program: Orca
programVersion: 5.0.2
elementType: O O O N C C C C C C C C C C C C C C C C C C C C H H H H H H H H H H H H H H H H H H H
charge: 0
multiplicity: 1
keywords: wb97x-d3
keywords: def2-TZVPP
keywords: def2/J RIJCOSX
keywords: DEFGRID2
keywords: scfconv7
keywords: smallprint printgap noloewdin
keywords: NOSOSCF
formula: C20H19NO3
InChI: InChI=1/C20H19NO3/c1-16(23-20-9-5-6-14-21-20)15-22-17-10-12-19(13-11-17)24-18-7-3-2-4-8-18/h2-14,16H,15H2,1H3
43 atoms
O  2.047558 2.018896 0.349259
O  3.639053 -1.168415 0.89475
O  -3.191263 1.943888 -1.332905
N  3.098954 -2.800212 -0.623975
C  3.054767 -0.185093 0.040094
C  2.675079 0.942855 1.001247
C  4.024278 0.261629 -1.035276
C  0.748142 1.91924 -0.013132
C  -0.074478 0.828283 0.250099
C  0.219202 3.014752 -0.691913
C  -1.913332 1.924383 -0.847091
C  3.613611 -2.454568 0.534244
C  -1.395815 0.830653 -0.173844
C  -1.101208 3.02108 -1.099502
C  -4.221909 1.547063 -0.536039
C  4.146534 -3.37541 1.444708
C  -4.251427 1.788824 0.832836
C  -5.291134 0.916843 -1.158896
C  4.122111 -4.706267 1.095196
C  3.081721 -4.090861 -0.945064
C  3.577577 -5.086379 -0.129696
C  -5.35632 1.390988 1.56986
C  -6.39195 0.532538 -0.410275
C  -6.429483 0.761188 0.957369
H  2.162373 -0.599144 -0.437018
H  2.058406 0.552557 1.819332
H  3.579205 1.35793 1.451459
H  4.949411 0.642654 -0.600005
H  4.265856 -0.563085 -1.703203
H  3.580075 1.055567 -1.634802
H  0.288917 -0.045491 0.772683
H  0.854757 3.867572 -0.891542
H  -2.015868 -0.034353 0.023789
H  -1.505179 3.876849 -1.62429
H  4.556281 -3.038103 2.386495
H  -3.42367 2.286211 1.32141
H  -5.253297 0.735975 -2.225105
H  4.522277 -5.449726 1.771931
H  2.646359 -4.331388 -1.908181
H  3.541413 -6.12147 -0.436902
H  -5.376347 1.582539 2.634676
H  -7.222279 0.042432 -0.901445
H  -7.287512 0.454172 1.53962
totalener: -1054.05558015 hartree
nucrepener: 1856.96387920 hartree
electener: -2911.01945935 hartree
oneelecener: -5119.87536210 hartree
twoeener: 2208.85590275 hartree
kineticenergy: 1049.52630045 hartree
xcener: -102.369255185599 hartree
chargesum: 0.0000000
charge: -0.300148 -0.298565 -0.304091 -0.367921 0.118125 0.036874 -0.282545 0.277390 -0.162650 -0.190357 0.194548 0.410326 -0.188395 -0.159855 0.241926 -0.238466 -0.154816 -0.210641 -0.068453 -0.007867 -0.151014 -0.123336 -0.092301 -0.147783 0.080824 0.094695 0.109285 0.081603 0.101309 0.098035 0.116084 0.117890 0.131913 0.123436 0.122409 0.129813 0.123800 0.130358 0.113296 0.123575 0.125145 0.122719 0.123824
qa: -0.3001 -0.2986 -0.3041 -0.3679 0.1181 0.0369 -0.2825 0.2774 -0.1627 -0.1904 0.1945 0.4103 -0.1884 -0.1599 0.2419 -0.2385 -0.1548 -0.2106 -0.0685 -0.0079 -0.1510 -0.1233 -0.0923 -0.1478 0.0808 0.0947 0.1093 0.0816 0.1013 0.0980 0.1161 0.1179 0.1319 0.1234 0.1224 0.1298 0.1238 0.1304 0.1133 0.1236 0.1251 0.1227 0.1238
va: 2.1002 2.1214 2.0976 2.9880 3.7675 3.8564 3.9401 3.8600 3.8598 4.0315 3.8647 3.9319 4.0076 4.0268 3.8183 3.9906 3.9214 4.0276 3.9242 4.0978 3.8754 3.9543 3.9384 3.9591 1.0389 1.0099 1.0019 1.0092 1.0164 1.0162 1.0108 1.0163 1.0046 1.0109 1.0136 1.0058 1.0145 0.9976 0.9989 1.0031 1.0002 0.9991 1.0006
dispcorr: -0.018132839 hartree
energy: -1054.073712988602
dipole: 4.54612 -4.17628 0.36984 -3.42211 2.58338 -0.83873 1.30161 -0.76463 0.53698
magnitude: 1.06236 au
magnitude: 2.70030 debye
