program: Orca
programVersion: 5.0.2
elementType: O O O N C C C C C C C C C C C C C C C C C C C C H H H H H H H H H H H H H H H H H H H
charge: 0
multiplicity: 1
keywords: wb97x-d3
keywords: def2-TZVPP
keywords: def2/J RIJCOSX
keywords: DEFGRID2
keywords: scfconv7
keywords: smallprint printgap noloewdin
keywords: NOSOSCF
formula: C20H19NO3
InChI: InChI=1/C20H19NO3/c1-16(23-20-9-5-6-14-21-20)15-22-17-10-12-19(13-11-17)24-18-7-3-2-4-8-18/h2-14,16H,15H2,1H3
43 atoms
O  2.277749 2.056963 -0.278482
O  3.655066 -1.138291 0.655355
O  -3.173137 2.737591 0.050707
N  2.486258 -2.952208 -0.123232
C  2.906127 -0.293938 -0.217818
C  2.995465 1.083426 0.439291
C  3.479864 -0.304971 -1.621103
C  0.933754 2.137015 -0.152653
C  0.161887 1.361089 0.707342
C  0.305528 3.092988 -0.947999
C  -1.828177 2.496502 -0.026293
C  3.410276 -2.452239 0.665765
C  -1.21176 1.548495 0.772407
C  -1.06456 3.266409 -0.891364
C  -4.052946 1.719721 -0.15594
C  4.171428 -3.229393 1.547202
C  -3.758892 0.601618 -0.927802
C  -5.309718 1.860989 0.420504
C  3.927036 -4.58363 1.579107
C  2.261529 -4.262456 -0.078277
C  2.948515 -5.12614 0.748609
C  -4.7301 -0.372293 -1.110297
C  -6.269883 0.882937 0.223229
C  -5.986049 -0.241952 -0.538465
H  1.866484 -0.632134 -0.25149
H  2.673863 1.030671 1.485639
H  4.033509 1.422429 0.440144
H  2.933573 0.390488 -2.257261
H  4.529934 -0.00796 -1.618862
H  3.397953 -1.295119 -2.065689
H  0.603929 0.607363 1.344079
H  0.90432 3.698125 -1.615954
H  -1.798598 0.944322 1.452464
H  -1.546115 4.008307 -1.514734
H  4.919687 -2.767716 2.176229
H  -2.785907 0.487287 -1.387121
H  -5.524246 2.737721 1.017443
H  4.493341 -5.218831 2.247632
H  1.49176 -4.632271 -0.745925
H  2.730403 -6.184263 0.74596
H  -4.496952 -1.24042 -1.712894
H  -7.245932 1.000088 0.675555
H  -6.736456 -1.006532 -0.686433
totalener: -1054.05586477 hartree
nucrepener: 1867.42624637 hartree
electener: -2921.48211114 hartree
oneelecener: -5140.75229210 hartree
twoeener: 2219.27018096 hartree
kineticenergy: 1049.51952165 hartree
xcener: -102.367868245033 hartree
chargesum: -0.0000000
charge: -0.299404 -0.298778 -0.303049 -0.368821 0.123079 0.033085 -0.283344 0.287260 -0.168557 -0.195828 0.178146 0.411419 -0.179554 -0.145235 0.248359 -0.240541 -0.157422 -0.212155 -0.067921 -0.006719 -0.151320 -0.127558 -0.091305 -0.150826 0.079221 0.095560 0.110228 0.097230 0.081966 0.101402 0.114995 0.117740 0.132437 0.123882 0.123666 0.129711 0.122726 0.130027 0.112524 0.123795 0.124553 0.122860 0.122466
qa: -0.2994 -0.2988 -0.3030 -0.3688 0.1231 0.0331 -0.2833 0.2873 -0.1686 -0.1958 0.1781 0.4114 -0.1796 -0.1452 0.2484 -0.2405 -0.1574 -0.2122 -0.0679 -0.0067 -0.1513 -0.1276 -0.0913 -0.1508 0.0792 0.0956 0.1102 0.0972 0.0820 0.1014 0.1150 0.1177 0.1324 0.1239 0.1237 0.1297 0.1227 0.1300 0.1125 0.1238 0.1246 0.1229 0.1225
va: 2.1003 2.1230 2.0973 2.9860 3.7671 3.8593 3.9383 3.8474 3.8639 4.0266 3.8774 3.9313 4.0289 4.0214 3.8148 3.9916 3.9113 4.0238 3.9247 4.0965 3.8770 3.9631 3.9425 3.9607 1.0402 1.0088 1.0020 1.0172 1.0090 1.0163 1.0119 1.0166 1.0039 1.0100 1.0134 1.0070 1.0150 0.9977 0.9991 1.0030 1.0003 0.9988 1.0009
dispcorr: -0.018171699 hartree
energy: -1054.074036464113
dipole: 4.06546 -3.53969 0.52577 -6.24427 5.26528 -0.97899 -2.57321 2.84910 0.27589
magnitude: 1.14497 au
magnitude: 2.91029 debye
