program: Orca
programVersion: 5.0.2
elementType: O O O N C C C C C C C C C C C C C C C C C C C C H H H H H H H H H H H H H H H H H H H
charge: 0
multiplicity: 1
keywords: wb97x-d3
keywords: def2-TZVPP
keywords: def2/J RIJCOSX
keywords: DEFGRID2
keywords: scfconv7
keywords: smallprint printgap noloewdin
keywords: NOSOSCF
formula: C20H19NO3
InChI: InChI=1/C20H19NO3/c1-16(23-20-9-5-6-14-21-20)15-22-17-10-12-19(13-11-17)24-18-7-3-2-4-8-18/h2-14,16H,15H2,1H3
43 atoms
O  2.933384 1.902051 -0.219039
O  2.700924 -0.767519 0.80083
O  -2.568594 2.043547 -0.184209
N  2.325347 -1.957811 -1.124687
C  3.921872 -0.268449 0.2609
C  3.657788 0.823341 -0.769972
C  4.7366 0.222526 1.440635
C  1.576539 1.851499 -0.238493
C  0.902273 2.167627 0.935834
C  0.846838 1.571994 -1.388938
C  -1.201575 1.938407 -0.191993
C  1.932653 -1.579619 0.071707
C  -0.480434 2.215003 0.95961
C  -0.539403 1.608529 -1.36186
C  -3.317343 0.980155 0.209601
C  0.72651 -1.993345 0.650721
C  -2.7978 -0.288866 0.433917
C  -4.678904 1.217613 0.373143
C  -0.07228 -2.843811 -0.078582
C  1.538371 -2.778039 -1.81649
C  0.33333 -3.254631 -1.346762
C  -3.652723 -1.310575 0.825158
C  -5.515128 0.186695 0.762042
C  -5.0087 -1.085762 0.993341
H  4.459634 -1.072902 -0.25266
H  4.617637 1.224119 -1.10433
H  3.163289 0.395913 -1.644882
H  4.919316 -0.584534 2.149075
H  5.703728 0.590615 1.097851
H  4.234844 1.034764 1.964922
H  1.471781 2.383302 1.830062
H  1.346476 1.3411 -2.320571
H  -1.00206 2.471232 1.872866
H  -1.105823 1.399806 -2.260158
H  0.447767 -1.647099 1.636264
H  -1.742722 -0.487957 0.300347
H  -5.068832 2.211108 0.194066
H  -1.010514 -3.190899 0.334746
H  1.900851 -3.064827 -2.797193
H  -0.271411 -3.918241 -1.947527
H  -3.245692 -2.29863 0.99958
H  -6.572116 0.381044 0.888816
H  -5.664247 -1.889405 1.299513
totalener: -1054.05345047 hartree
nucrepener: 2019.99701566 hartree
electener: -3074.05046614 hartree
oneelecener: -5446.05457833 hartree
twoeener: 2372.00411219 hartree
kineticenergy: 1049.53474034 hartree
xcener: -102.370792104973 hartree
chargesum: 0.0000000
charge: -0.319418 -0.281264 -0.300057 -0.356591 0.156029 -0.025634 -0.256255 0.228832 -0.159807 -0.132396 0.186261 0.372234 -0.126267 -0.152742 0.211417 -0.212572 -0.086947 -0.185298 -0.083982 -0.011199 -0.145038 -0.149304 -0.105411 -0.141228 0.071187 0.100316 0.106962 0.093401 0.075017 0.094028 0.113682 0.110476 0.125043 0.121933 0.126770 0.080342 0.121987 0.143902 0.112782 0.122434 0.113550 0.121631 0.121193
qa: -0.3194 -0.2813 -0.3001 -0.3566 0.1560 -0.0256 -0.2563 0.2288 -0.1598 -0.1324 0.1863 0.3722 -0.1263 -0.1527 0.2114 -0.2126 -0.0869 -0.1853 -0.0840 -0.0112 -0.1450 -0.1493 -0.1054 -0.1412 0.0712 0.1003 0.1070 0.0934 0.0750 0.0940 0.1137 0.1105 0.1250 0.1219 0.1268 0.0803 0.1220 0.1439 0.1128 0.1224 0.1135 0.1216 0.1212
va: 2.0522 2.1216 2.1061 2.9698 3.7827 3.8622 3.9541 3.8723 4.0066 3.8709 3.8614 3.9622 4.0070 3.9798 3.9303 3.9170 3.8657 3.9998 3.9000 4.0932 3.8887 3.9789 3.9689 3.9830 1.0341 1.0059 1.0158 1.0097 1.0081 1.0130 1.0125 1.0098 1.0053 1.0097 1.0162 1.0451 1.0163 0.9895 0.9996 1.0042 1.0073 0.9990 1.0022
dispcorr: -0.023263390 hartree
energy: -1054.076713863475
dipole: 6.06194 -5.74188 0.32005 -5.01746 4.24605 -0.77141 2.01538 -2.13101 -0.11563
magnitude: 0.84313 au
magnitude: 2.14307 debye
