program: Orca
programVersion: 5.0.2
elementType: O O O N C C C C C C C C C C C C C C C C C C C C H H H H H H H H H H H H H H H H H H H
charge: 0
multiplicity: 1
keywords: wb97x-d3
keywords: def2-TZVPP
keywords: def2/J RIJCOSX
keywords: DEFGRID2
keywords: scfconv7
keywords: smallprint printgap noloewdin
keywords: NOSOSCF
formula: C20H19NO3
InChI: InChI=1/C20H19NO3/c1-16(23-20-9-5-6-14-21-20)15-22-17-10-12-19(13-11-17)24-18-7-3-2-4-8-18/h2-14,16H,15H2,1H3
43 atoms
O  2.863981 1.656389 -0.512782
O  2.629649 -0.779392 1.032252
O  -2.63814 1.614737 -0.675151
N  2.576407 -1.678046 -1.085358
C  3.879812 -0.147275 0.772058
C  3.647394 1.348848 0.614859
C  4.797627 -0.438387 1.943502
C  1.509984 1.612954 -0.456126
C  0.856492 1.260775 -1.632219
C  0.756048 1.940996 0.666394
C  -1.271322 1.578421 -0.573973
C  1.983517 -1.436144 0.060158
C  -0.525945 1.240529 -1.691139
C  -0.628613 1.927369 0.603474
C  -3.394925 0.770553 0.073381
C  0.674793 -1.839016 0.347472
C  -2.891886 -0.367589 0.692048
C  -4.746606 1.08136 0.180529
C  -0.020667 -2.505421 -0.635772
C  1.892055 -2.324675 -2.024183
C  0.593004 -2.757824 -1.860577
C  -3.746876 -1.184511 1.418531
C  -5.586967 0.253429 0.904455
C  -5.094454 -0.883141 1.531468
H  4.309448 -0.541779 -0.150669
H  3.233706 1.762144 1.541163
H  4.610501 1.83766 0.453052
H  5.768846 0.034297 1.794512
H  4.381983 -0.069704 2.882413
H  4.963385 -1.509946 2.04508
H  1.444451 0.992947 -2.499588
H  1.226138 2.226422 1.59718
H  -1.028355 0.962237 -2.608073
H  -1.207053 2.199226 1.477421
H  0.238934 -1.615227 1.311514
H  -1.843196 -0.616162 0.607285
H  -5.126798 1.970606 -0.304978
H  -1.040322 -2.823008 -0.45863
H  2.419106 -2.501088 -2.955118
H  0.076615 -3.273688 -2.657069
H  -3.348526 -2.068819 1.899569
H  -6.636678 0.504118 0.983762
H  -5.753768 -1.52409 2.10052
totalener: -1054.05160768 hartree
nucrepener: 2033.01964120 hartree
electener: -3087.07124888 hartree
oneelecener: -5472.18703174 hartree
twoeener: 2385.11578286 hartree
kineticenergy: 1049.53949726 hartree
xcener: -102.375210815813 hartree
chargesum: 0.0000000
charge: -0.304206 -0.294964 -0.302963 -0.328787 0.169883 -0.011452 -0.260810 0.203605 -0.124847 -0.081252 0.261502 0.387715 -0.225558 -0.192213 0.218534 -0.237243 -0.082281 -0.183880 -0.060137 -0.015404 -0.150295 -0.174131 -0.110908 -0.124115 0.078258 0.077810 0.102571 0.081032 0.085089 0.095304 0.118628 0.104130 0.116937 0.128746 0.118619 0.068764 0.122547 0.126827 0.112540 0.122738 0.119214 0.122605 0.121847
qa: -0.3042 -0.2950 -0.3030 -0.3288 0.1699 -0.0115 -0.2608 0.2036 -0.1248 -0.0813 0.2615 0.3877 -0.2256 -0.1922 0.2185 -0.2372 -0.0823 -0.1839 -0.0601 -0.0154 -0.1503 -0.1741 -0.1109 -0.1241 0.0783 0.0778 0.1026 0.0810 0.0851 0.0953 0.1186 0.1041 0.1169 0.1287 0.1186 0.0688 0.1225 0.1268 0.1125 0.1227 0.1192 0.1226 0.1218
va: 2.0963 2.1125 2.1106 3.0113 3.7448 3.9380 3.9638 3.8624 3.9276 3.8526 3.7725 3.9830 4.0331 4.0165 3.8798 3.9101 3.8317 3.9919 3.8922 4.0756 3.8784 3.9997 3.9657 3.9469 1.0488 0.9983 1.0055 1.0075 1.0078 1.0097 1.0171 1.0122 1.0130 1.0050 1.0130 1.0341 1.0159 1.0014 0.9997 1.0030 1.0036 0.9992 1.0010
dispcorr: -0.024043575 hartree
energy: -1054.075651259434
dipole: 6.29664 -5.93093 0.36571 -3.87797 3.49337 -0.38459 6.57877 -6.08430 0.49447
magnitude: 0.72537 au
magnitude: 1.84374 debye
