program: Orca
programVersion: 5.0.2
elementType: O O O C C C C C C C C C C C C C C C C C C C H H H H H H H H H H H H H H H H H H H H H H H H H H H H H H H H H H
charge: 0
multiplicity: 1
keywords: wb97x-d3
keywords: def2-TZVPP
keywords: def2/J RIJCOSX
keywords: DEFGRID2
keywords: scfconv7
keywords: smallprint printgap noloewdin
keywords: NOSOSCF
formula: C19H34O3
InChI: InChI=1/C19H34O3/c1-15(2)22-18(20)14-17(4)11-8-10-16(3)12-9-13-19(5,6)21-7/h8,11,14-16H,9-10,12-13H2,1-7H3
56 atoms
O  -2.488884 3.209199 0.839522
O  4.120444 -0.723272 0.433607
O  3.502571 -0.360771 -1.685322
C  -2.939858 0.289481 1.162943
C  -2.747787 1.081336 -0.125328
C  -4.08813 -0.71222 1.092448
C  -1.816656 2.29524 -0.030708
C  -4.007877 -1.808311 0.026994
C  -2.74093 -2.67699 0.14978
C  -1.655949 2.900096 -1.424928
C  -0.447818 1.89878 0.518035
C  -5.25464 -2.682891 0.118671
C  -1.557243 -2.140414 -0.580127
C  -1.796728 4.379933 1.204293
C  -0.33925 -1.96022 -0.057709
C  0.812034 -1.435272 -0.786532
C  0.606129 -1.07198 -2.22266
C  1.96004 -1.286178 -0.087848
C  3.234587 -0.743647 -0.563596
C  5.442389 -0.188522 0.199946
C  5.414216 1.325236 0.28538
C  6.341073 -0.806909 1.248765
H  -3.151772 0.974157 1.988221
H  -2.014438 -0.224765 1.432532
H  -3.722774 1.427843 -0.487906
H  -2.356566 0.424291 -0.906688
H  -5.021239 -0.15921 0.938404
H  -4.186585 -1.198335 2.069538
H  -4.005171 -1.341368 -0.96483
H  -2.962487 -3.65829 -0.286752
H  -2.50118 -2.856004 1.202236
H  -1.198134 2.172612 -2.097149
H  -1.014924 3.783221 -1.425991
H  -2.62233 3.181287 -1.848487
H  -0.501978 1.551426 1.550981
H  -0.028322 1.089551 -0.080553
H  0.265197 2.724303 0.480017
H  -6.164119 -2.085184 0.03618
H  -5.29511 -3.212566 1.073574
H  -5.27729 -3.430949 -0.675505
H  -1.732692 -1.908699 -1.626802
H  -0.915235 4.181753 1.821735
H  -2.483671 4.987039 1.794527
H  -1.479734 4.979428 0.345471
H  -0.179367 -2.193661 0.991175
H  0.232999 -1.931419 -2.781303
H  -0.156008 -0.292897 -2.301893
H  1.503398 -0.715865 -2.710919
H  1.9525 -1.579517 0.955571
H  5.780741 -0.498116 -0.791299
H  6.418613 1.716953 0.122967
H  4.763575 1.770457 -0.466763
H  5.081317 1.656094 1.270403
H  6.034122 -0.526016 2.257436
H  7.362594 -0.457081 1.101969
H  6.350564 -1.894873 1.178736
elementType: O C H
totalener: -970.27188705 hartree
nucrepener: 1903.52527148 hartree
electener: -2873.79715854 hartree
oneelecener: -5099.61479707 hartree
twoeener: 2225.81763853 hartree
cpcmener: -0.02823975 hartree
kineticenergy: 965.60799990 hartree
xcener: -96.767208769616 hartree
chargesum: -0.0000000
charge: -0.417483 -0.300234 -0.519783 -0.102211 -0.189042 -0.231426 0.354589 0.094061 -0.133009 -0.332190 -0.360329 -0.309455 -0.113824 -0.121586 -0.185397 0.005522 -0.249855 -0.190730 0.503565 0.159576 -0.264038 -0.254497 0.080983 0.071775 0.088366 0.073522 0.076152 0.079497 0.048949 0.096766 0.087056 0.098018 0.101101 0.099308 0.107852 0.067867 0.112143 0.089067 0.087585 0.089519 0.127171 0.093319 0.118204 0.091207 0.120089 0.114702 0.091914 0.109857 0.115156 0.062666 0.098030 0.093231 0.089920 0.088797 0.090986 0.097004
qa: -0.4175 -0.3002 -0.5198 -0.1022 -0.1890 -0.2314 0.3546 0.0941 -0.1330 -0.3322 -0.3603 -0.3095 -0.1138 -0.1216 -0.1854 0.0055 -0.2499 -0.1907 0.5036 0.1596 -0.2640 -0.2545 0.0810 0.0718 0.0884 0.0735 0.0762 0.0795 0.0489 0.0968 0.0871 0.0980 0.1011 0.0993 0.1079 0.0679 0.1121 0.0891 0.0876 0.0895 0.1272 0.0933 0.1182 0.0912 0.1201 0.1147 0.0919 0.1099 0.1152 0.0627 0.0980 0.0932 0.0899 0.0888 0.0910 0.0970
va: 1.9361 2.1250 1.9744 3.8088 3.7455 3.9556 3.8403 3.6982 3.9100 3.9282 3.9335 3.9363 3.8372 3.9228 3.8681 3.6715 3.9013 3.7657 4.1326 3.8117 3.9056 3.9338 1.0345 1.0082 1.0290 1.0095 1.0084 1.0085 1.0193 1.0016 1.0129 0.9981 1.0035 1.0093 0.9975 1.0221 1.0027 1.0045 1.0007 1.0039 1.0001 0.9822 0.9922 0.9832 1.0201 0.9977 0.9972 1.0375 1.0344 1.0236 1.0056 1.0176 1.0068 1.0068 1.0051 1.0081
dispcorr: -0.028205288 hartree
energy: -970.300092342099
dipole: -12.51295 12.34859 -0.16436 6.05198 -6.34581 -0.29383 3.15038 -2.71032 0.44006
magnitude: 0.55408 au
magnitude: 1.40837 debye
