program: Orca
programVersion: 5.0.2
elementType: O O O C C C C C C C C C C C C C C C C C C C H H H H H H H H H H H H H H H H H H H H H H H H H H H H H H H H H H
charge: 0
multiplicity: 1
keywords: wb97x-d3
keywords: def2-TZVPP
keywords: def2/J RIJCOSX
keywords: DEFGRID2
keywords: scfconv7
keywords: smallprint printgap noloewdin
keywords: NOSOSCF
formula: C19H34O3
InChI: InChI=1/C19H34O3/c1-15(2)22-18(20)14-17(4)11-8-10-16(3)12-9-13-19(5,6)21-7/h8,11,14-16H,9-10,12-13H2,1-7H3
56 atoms
O  -5.462285 3.327797 -0.664496
O  5.257245 -1.769066 -0.581676
O  4.801184 -1.161859 1.524483
C  -3.400416 1.188205 -0.419821
C  -3.678202 2.252793 0.634055
C  -2.831268 -0.084852 0.196942
C  -4.288221 3.564812 0.11666
C  -2.450322 -1.160036 -0.821023
C  -1.785736 -2.375398 -0.149838
C  -3.332131 4.274233 -0.8352
C  -4.587467 4.482135 1.30148
C  -3.648788 -1.630609 -1.637266
C  -0.54666 -2.032681 0.610514
C  -6.558151 2.735081 -0.007073
C  0.680649 -2.134209 0.088691
C  1.924394 -1.772056 0.76281
C  1.834038 -1.321023 2.185023
C  3.055324 -1.873563 0.030545
C  4.425423 -1.557415 0.43916
C  6.668883 -1.5089 -0.420985
C  7.377557 -2.38783 -1.428638
C  6.954021 -0.035616 -0.637574
H  -2.691964 1.566681 -1.163153
H  -4.320349 0.95873 -0.96245
H  -2.745812 2.506862 1.147888
H  -4.326864 1.827379 1.40747
H  -3.554485 -0.503902 0.906804
H  -1.948665 0.183469 0.786894
H  -1.71361 -0.72869 -1.509594
H  -1.54641 -3.108213 -0.924686
H  -2.510708 -2.845432 0.522327
H  -3.741365 5.234968 -1.153645
H  -3.130178 3.685067 -1.730783
H  -2.378754 4.467091 -0.342973
H  -3.658866 4.758096 1.802513
H  -5.073631 5.404079 0.97617
H  -5.22516 4.006722 2.048515
H  -4.435053 -2.024109 -0.988147
H  -3.364521 -2.425347 -2.329349
H  -4.081972 -0.826418 -2.232025
H  -0.676249 -1.660834 1.62155
H  -6.317649 1.771285 0.452349
H  -7.326435 2.559127 -0.760384
H  -6.991659 3.378306 0.765082
H  0.782267 -2.505311 -0.927884
H  1.360458 -2.093366 2.793206
H  2.795919 -1.087829 2.623084
H  1.201598 -0.434568 2.259723
H  2.958359 -2.218625 -0.992251
H  6.972456 -1.800869 0.586669
H  7.161847 -3.443286 -1.261009
H  7.095963 -2.133579 -2.451712
H  8.454698 -2.251494 -1.335604
H  6.436953 0.595365 0.084866
H  6.663413 0.277664 -1.641617
H  8.023054 0.147849 -0.527076
elementType: O C H
totalener: -970.27440352 hartree
nucrepener: 1758.03214788 hartree
electener: -2728.30655140 hartree
oneelecener: -4808.54049535 hartree
twoeener: 2080.23394395 hartree
cpcmener: -0.02873015 hartree
kineticenergy: 965.61121373 hartree
xcener: -96.763163666433 hartree
chargesum: 0.0000000
charge: -0.436327 -0.299542 -0.518103 -0.140735 -0.253032 -0.190524 0.391178 0.107530 -0.144324 -0.323745 -0.337653 -0.332676 -0.130461 -0.125512 -0.150934 0.006508 -0.263045 -0.180950 0.488646 0.160548 -0.254702 -0.263650 0.077710 0.072604 0.093009 0.088590 0.073258 0.077253 0.044864 0.086763 0.095589 0.100464 0.097311 0.091632 0.099933 0.103261 0.099183 0.088037 0.093289 0.094558 0.133629 0.090077 0.124236 0.095975 0.115102 0.107481 0.106910 0.105549 0.115864 0.061760 0.097092 0.089029 0.090778 0.093739 0.089728 0.097249
qa: -0.4363 -0.2995 -0.5181 -0.1407 -0.2530 -0.1905 0.3912 0.1075 -0.1443 -0.3237 -0.3377 -0.3327 -0.1305 -0.1255 -0.1509 0.0065 -0.2630 -0.1810 0.4886 0.1605 -0.2547 -0.2637 0.0777 0.0726 0.0930 0.0886 0.0733 0.0773 0.0449 0.0868 0.0956 0.1005 0.0973 0.0916 0.0999 0.1033 0.0992 0.0880 0.0933 0.0946 0.1336 0.0901 0.1242 0.0960 0.1151 0.1075 0.1069 0.1055 0.1159 0.0618 0.0971 0.0890 0.0908 0.0937 0.0897 0.0972
va: 1.9015 2.1240 1.9770 3.8584 3.8429 3.8971 3.7698 3.7775 3.9168 3.9099 3.9171 3.9513 3.8718 3.9200 3.8974 3.7028 3.9221 3.7821 4.1457 3.8118 3.9327 3.9082 1.0098 1.0164 1.0121 1.0009 1.0102 1.0109 1.0222 1.0135 1.0069 1.0089 1.0059 1.0050 1.0055 1.0076 0.9982 1.0006 1.0048 1.0006 0.9917 0.9808 0.9892 0.9856 1.0228 0.9964 1.0356 0.9960 1.0339 1.0243 1.0082 1.0067 1.0053 1.0165 1.0067 1.0058
dispcorr: -0.023613112 hartree
energy: -970.298016634196
dipole: -20.55930 19.83186 -0.72744 10.43095 -10.80953 -0.37857 -2.50826 2.48815 -0.02011
magnitude: 0.82030 au
magnitude: 2.08504 debye
