program: Orca
programVersion: 5.0.2
elementType: O O O C C C C C C C C C C C C C C C C C C C H H H H H H H H H H H H H H H H H H H H H H H H H H H H H H H H H H
charge: 0
multiplicity: 1
keywords: wb97x-d3
keywords: def2-TZVPP
keywords: def2/J RIJCOSX
keywords: DEFGRID2
keywords: scfconv7
keywords: smallprint printgap noloewdin
keywords: NOSOSCF
formula: C19H34O3
InChI: InChI=1/C19H34O3/c1-15(2)22-18(20)14-17(4)11-8-10-16(3)12-9-13-19(5,6)21-7/h8,11,14-16H,9-10,12-13H2,1-7H3
56 atoms
O  -3.358482 3.782731 1.511083
O  5.128615 -0.944335 -0.159077
O  4.640996 -3.060621 -0.700431
C  -3.499858 1.325315 -0.165177
C  -4.671664 2.260766 0.107478
C  -3.955466 -0.113987 -0.3774
C  -4.296513 3.714013 0.434245
C  -2.827858 -1.102399 -0.684565
C  -1.91668 -1.301133 0.539677
C  -5.563881 4.505037 0.753938
C  -3.579448 4.368766 -0.740533
C  -3.40205 -2.429345 -1.166642
C  -0.683481 -2.081791 0.232294
C  -3.78682 3.295729 2.761574
C  0.540573 -1.542453 0.221359
C  1.777999 -2.245911 -0.104441
C  1.677999 -3.697346 -0.447712
C  2.912932 -1.513467 -0.065288
C  4.279912 -1.955917 -0.347303
C  6.541858 -1.148823 -0.377919
C  6.868275 -1.002274 -1.851199
C  7.25457 -0.122249 0.475226
H  -2.790783 1.374158 0.664785
H  -2.952856 1.655036 -1.05354
H  -5.276685 1.847424 0.921616
H  -5.334247 2.279052 -0.763375
H  -4.669971 -0.135381 -1.207206
H  -4.507084 -0.461318 0.504213
H  -2.217929 -0.677487 -1.490814
H  -2.49476 -1.817123 1.314828
H  -1.628167 -0.331876 0.951047
H  -6.157344 4.042114 1.543968
H  -6.198753 4.563749 -0.130851
H  -5.326571 5.526042 1.059254
H  -2.628127 3.882961 -0.961537
H  -4.195174 4.31676 -1.63855
H  -3.376631 5.421983 -0.536909
H  -4.034022 -2.28506 -2.044519
H  -4.015975 -2.893445 -0.390812
H  -2.624707 -3.143048 -1.442855
H  -0.814274 -3.131904 -0.009099
H  -4.109761 2.250397 2.730942
H  -4.599182 3.887387 3.194921
H  -2.934699 3.357911 3.43882
H  0.644643 -0.48967 0.470088
H  2.631871 -4.148302 -0.688555
H  1.240129 -4.249923 0.385273
H  1.009831 -3.836366 -1.299282
H  2.823684 -0.468713 0.208831
H  6.812851 -2.149977 -0.035723
H  6.351286 -1.740067 -2.464081
H  6.608025 -0.006717 -2.214133
H  7.93885 -1.143338 -2.00154
H  8.331902 -0.249145 0.371744
H  7.007807 -0.238199 1.530868
H  7.007359 0.895678 0.169827
elementType: O C H
totalener: -970.27474074 hartree
nucrepener: 1756.29107131 hartree
electener: -2726.56581205 hartree
oneelecener: -4805.13944242 hartree
twoeener: 2078.57363036 hartree
cpcmener: -0.02872324 hartree
kineticenergy: 965.61439059 hartree
xcener: -96.763787529212 hartree
chargesum: 0.0000000
charge: -0.433861 -0.300219 -0.518293 -0.134173 -0.254286 -0.184854 0.388664 0.110760 -0.131404 -0.336138 -0.324519 -0.316593 -0.139354 -0.126934 -0.154538 0.008531 -0.266420 -0.176589 0.487100 0.160221 -0.263841 -0.254809 0.065348 0.074427 0.088015 0.093064 0.075411 0.071997 0.043523 0.092068 0.084392 0.099484 0.099229 0.102629 0.097119 0.091532 0.101172 0.091034 0.085915 0.088772 0.132921 0.089833 0.097458 0.124398 0.114748 0.107166 0.107340 0.106377 0.116247 0.062203 0.093472 0.090055 0.097282 0.090814 0.097059 0.089046
qa: -0.4339 -0.3002 -0.5183 -0.1342 -0.2543 -0.1849 0.3887 0.1108 -0.1314 -0.3361 -0.3245 -0.3166 -0.1394 -0.1269 -0.1545 0.0085 -0.2664 -0.1766 0.4871 0.1602 -0.2638 -0.2548 0.0653 0.0744 0.0880 0.0931 0.0754 0.0720 0.0435 0.0921 0.0844 0.0995 0.0992 0.1026 0.0971 0.0915 0.1012 0.0910 0.0859 0.0888 0.1329 0.0898 0.0975 0.1244 0.1147 0.1072 0.1073 0.1064 0.1162 0.0622 0.0935 0.0901 0.0973 0.0908 0.0971 0.0890
va: 1.9062 2.1239 1.9766 3.8526 3.8428 3.9047 3.7753 3.7632 3.9263 3.9124 3.9077 3.9509 3.8807 3.9170 3.9292 3.7041 3.9244 3.7832 4.1455 3.8110 3.9076 3.9325 1.0267 1.0112 1.0010 1.0121 1.0108 1.0100 1.0241 1.0081 1.0193 0.9980 1.0056 1.0082 1.0057 1.0047 1.0087 1.0043 1.0015 1.0034 0.9949 0.9813 0.9858 0.9899 1.0228 1.0358 0.9954 0.9961 1.0337 1.0241 1.0169 1.0067 1.0057 1.0052 1.0082 1.0068
dispcorr: -0.023506552 hartree
energy: -970.298247293540
dipole: -23.06379 21.45044 -1.61334 11.10190 -10.62076 0.48114 -0.83267 1.08498 0.25231
magnitude: 1.70236 au
magnitude: 4.32706 debye
