program: Orca
programVersion: 5.0.2
elementType: O O O C C C C C C C C C C C C C C C C C C C H H H H H H H H H H H H H H H H H H H H H H H H H H H H H H H H H H
charge: 0
multiplicity: 1
keywords: wb97x-d3
keywords: def2-TZVPP
keywords: def2/J RIJCOSX
keywords: DEFGRID2
keywords: scfconv7
keywords: smallprint printgap noloewdin
keywords: NOSOSCF
formula: C19H34O3
InChI: InChI=1/C19H34O3/c1-15(2)22-18(20)14-17(4)11-8-10-16(3)12-9-13-19(5,6)21-7/h8,11,14-16H,9-10,12-13H2,1-7H3
56 atoms
O  -0.343122 3.077555 0.874772
O  3.359258 -0.092548 0.550753
O  2.934857 -0.113116 -1.645859
C  -2.897151 0.35651 0.054156
C  -1.899041 1.223197 0.815022
C  -3.498181 -0.723428 0.955576
C  -1.317681 2.421654 0.050822
C  -4.090498 -1.929754 0.213808
C  -3.03564 -3.036369 0.003572
C  -2.39155 3.47855 -0.177336
C  -0.717312 2.00594 -1.289404
C  -5.277108 -2.514603 0.970234
C  -1.838376 -2.576827 -0.752178
C  0.897799 2.432903 1.055142
C  -0.654965 -2.31066 -0.1879
C  0.472949 -1.690855 -0.875708
C  0.395328 -1.578927 -2.365016
C  1.469065 -1.216171 -0.094531
C  2.635345 -0.439321 -0.514144
C  4.549351 0.706617 0.371115
C  4.753698 1.459367 1.667609
C  5.724871 -0.185666 0.025583
H  -2.398731 -0.103973 -0.80065
H  -3.707449 0.962544 -0.361079
H  -1.08265 0.56851 1.138468
H  -2.370086 1.598145 1.730816
H  -4.270799 -0.260894 1.577083
H  -2.736835 -1.081908 1.65817
H  -4.443755 -1.599796 -0.770219
H  -3.506083 -3.865804 -0.533239
H  -2.734474 -3.415352 0.984881
H  -2.817339 3.819913 0.768446
H  -3.20677 3.083846 -0.782625
H  -1.985897 4.346102 -0.701422
H  -0.218592 2.850316 -1.769717
H  0.007408 1.195686 -1.195282
H  -1.498728 1.66375 -1.967712
H  -6.078377 -1.781414 1.074102
H  -4.984953 -2.828598 1.975223
H  -5.689943 -3.386479 0.459488
H  -1.985754 -2.391522 -1.812185
H  1.455733 3.01799 1.787154
H  1.493053 2.394014 0.137317
H  0.807473 1.415568 1.44742
H  -0.537865 -2.47407 0.879894
H  0.093629 -2.532301 -2.798723
H  -0.367622 -0.84989 -2.647924
H  1.329121 -1.277878 -2.822261
H  1.386372 -1.372957 0.975029
H  4.378647 1.423025 -0.435466
H  3.901675 2.101469 1.895463
H  4.911841 0.780703 2.507281
H  5.634334 2.095698 1.582852
H  5.566626 -0.732813 -0.903572
H  5.919867 -0.905591 0.822023
H  6.620484 0.423007 -0.10163
elementType: O C H
totalener: -970.27223209 hartree
nucrepener: 1969.49926725 hartree
electener: -2939.77149934 hartree
oneelecener: -5231.26840891 hartree
twoeener: 2291.49690957 hartree
cpcmener: -0.02848948 hartree
kineticenergy: 965.60858535 hartree
xcener: -96.766437753862 hartree
chargesum: -0.0000000
charge: -0.424724 -0.300087 -0.521063 -0.143646 -0.286342 -0.200545 0.447831 0.081322 -0.131385 -0.314295 -0.353422 -0.313502 -0.078798 -0.129854 -0.208700 0.032970 -0.267061 -0.217270 0.505344 0.148033 -0.253044 -0.264739 0.078751 0.099529 0.081814 0.088041 0.085893 0.071503 0.050368 0.089122 0.081519 0.097499 0.090571 0.098381 0.113741 0.052211 0.103717 0.089508 0.087514 0.089321 0.132040 0.123097 0.094133 0.087321 0.119411 0.116003 0.106508 0.112381 0.120699 0.068063 0.097661 0.090091 0.093890 0.093397 0.090689 0.098591
qa: -0.4247 -0.3001 -0.5211 -0.1436 -0.2863 -0.2005 0.4478 0.0813 -0.1314 -0.3143 -0.3534 -0.3135 -0.0788 -0.1299 -0.2087 0.0330 -0.2671 -0.2173 0.5053 0.1480 -0.2530 -0.2647 0.0788 0.0995 0.0818 0.0880 0.0859 0.0715 0.0504 0.0891 0.0815 0.0975 0.0906 0.0984 0.1137 0.0522 0.1037 0.0895 0.0875 0.0893 0.1320 0.1231 0.0941 0.0873 0.1194 0.1160 0.1065 0.1124 0.1207 0.0681 0.0977 0.0901 0.0939 0.0934 0.0907 0.0986
va: 1.9486 2.1166 1.9620 3.8249 3.9345 3.8890 3.7371 3.7441 3.9359 3.9081 3.9380 3.9468 3.8160 3.9628 3.9086 3.6250 3.8998 3.7583 4.1004 3.8065 3.9321 3.9214 0.9996 1.0063 1.0013 1.0228 1.0065 1.0094 1.0211 1.0089 1.0115 1.0105 1.0030 1.0108 1.0118 1.0126 0.9988 1.0038 0.9994 1.0045 0.9987 0.9941 0.9809 0.9711 1.0200 0.9999 0.9945 1.0323 1.0314 1.0223 1.0052 1.0069 1.0064 1.0160 1.0064 1.0054
dispcorr: -0.031342072 hartree
energy: -970.303574163467
dipole: -12.34977 11.48214 -0.86764 2.80628 -3.81964 -1.01336 2.95158 -2.63280 0.31878
magnitude: 1.37161 au
magnitude: 3.48636 debye
