program: Orca
programVersion: 5.0.2
elementType: O O O C C C C C C C C C C C C C C C C C C C H H H H H H H H H H H H H H H H H H H H H H H H H H H H H H H H H H
charge: 0
multiplicity: 1
keywords: wb97x-d3
keywords: def2-TZVPP
keywords: def2/J RIJCOSX
keywords: DEFGRID2
keywords: scfconv7
keywords: smallprint printgap noloewdin
keywords: NOSOSCF
formula: C19H34O3
InChI: InChI=1/C19H34O3/c1-15(2)22-18(20)14-17(4)11-8-10-16(3)12-9-13-19(5,6)21-7/h8,11,14-16H,9-10,12-13H2,1-7H3
56 atoms
O  -5.369928 3.537105 -0.664497
O  5.244293 -1.185346 -0.298629
O  4.505287 -2.027248 1.638761
C  -3.718612 1.114267 -0.088737
C  -3.267971 2.553602 0.130742
C  -2.543046 0.200779 -0.419526
C  -4.385638 3.579023 0.371993
C  -2.937776 -1.243756 -0.724939
C  -1.747289 -2.034683 -1.293742
C  -3.771959 4.972943 0.496297
C  -5.157516 3.256616 1.646004
C  -3.554105 -1.945479 0.481022
C  -0.606649 -2.185218 -0.345828
C  -4.940282 3.8641 -1.965409
C  0.644717 -1.789877 -0.605192
C  1.782472 -1.952638 0.296614
C  1.513514 -2.546872 1.641953
C  2.987973 -1.556543 -0.168705
C  4.282728 -1.630034 0.512261
C  6.617585 -1.201693 0.148842
C  7.206564 -2.588923 -0.020235
C  7.342405 -0.163608 -0.680286
H  -4.445402 1.065526 -0.905693
H  -4.233473 0.747328 0.802702
H  -2.658514 2.871191 -0.72219
H  -2.596166 2.592443 0.993934
H  -1.824199 0.216173 0.40792
H  -2.01347 0.611783 -1.286369
H  -3.692744 -1.222301 -1.519061
H  -1.40226 -1.560652 -2.21639
H  -2.10424 -3.034499 -1.56612
H  -3.137541 5.023131 1.382057
H  -4.544163 5.737946 0.599179
H  -3.147396 5.232975 -0.359973
H  -5.906357 4.023357 1.853922
H  -5.672426 2.29721 1.580493
H  -4.481481 3.213613 2.500106
H  -2.895715 -1.90974 1.35165
H  -3.759166 -2.995637 0.263867
H  -4.499406 -1.486755 0.771725
H  -0.830746 -2.664197 0.602237
H  -5.787601 3.704685 -2.632637
H  -4.11701 3.236245 -2.320138
H  -4.632585 4.910005 -2.063401
H  0.856064 -1.320282 -1.56207
H  0.753567 -1.963083 2.163596
H  1.111795 -3.556032 1.533717
H  2.391761 -2.599426 2.271789
H  3.02766 -1.145453 -1.170815
H  6.652358 -0.909542 1.200721
H  7.188806 -2.897821 -1.066572
H  8.245624 -2.58454 0.309744
H  6.678864 -3.337241 0.570132
H  8.386708 -0.117199 -0.372336
H  6.913034 0.829281 -0.544391
H  7.318232 -0.410614 -1.742835
elementType: O C H
totalener: -970.27481130 hartree
nucrepener: 1761.01996481 hartree
electener: -2731.29477611 hartree
oneelecener: -4814.54212303 hartree
twoeener: 2083.24734692 hartree
cpcmener: -0.02875760 hartree
kineticenergy: 965.60732416 hartree
xcener: -96.763872987129 hartree
chargesum: 0.0000000
charge: -0.436712 -0.299633 -0.518302 -0.148796 -0.247594 -0.200297 0.393868 0.121720 -0.129443 -0.335496 -0.326229 -0.338886 -0.150381 -0.123753 -0.151470 0.018594 -0.264946 -0.185854 0.488616 0.159100 -0.263192 -0.254842 0.068360 0.084129 0.087357 0.093156 0.073490 0.076529 0.042218 0.085021 0.099326 0.099711 0.102717 0.098957 0.101163 0.095320 0.091961 0.083261 0.099845 0.096362 0.134159 0.123485 0.089360 0.094956 0.115940 0.105201 0.107583 0.108271 0.116030 0.062672 0.089942 0.097315 0.092997 0.090362 0.097785 0.088987
qa: -0.4367 -0.2996 -0.5183 -0.1488 -0.2476 -0.2003 0.3939 0.1217 -0.1294 -0.3355 -0.3262 -0.3389 -0.1504 -0.1238 -0.1515 0.0186 -0.2649 -0.1859 0.4886 0.1591 -0.2632 -0.2548 0.0684 0.0841 0.0874 0.0932 0.0735 0.0765 0.0422 0.0850 0.0993 0.0997 0.1027 0.0990 0.1012 0.0953 0.0920 0.0833 0.0998 0.0964 0.1342 0.1235 0.0894 0.0950 0.1159 0.1052 0.1076 0.1083 0.1160 0.0627 0.0899 0.0973 0.0930 0.0904 0.0978 0.0890
va: 1.9003 2.1238 1.9764 3.8746 3.8341 3.9232 3.7642 3.7462 3.9102 3.9184 3.9121 3.9587 3.8760 3.9222 3.9064 3.7015 3.9199 3.7848 4.1442 3.8129 3.9056 3.9332 1.0182 1.0030 1.0019 1.0116 1.0066 1.0121 1.0187 1.0133 1.0041 1.0051 1.0079 0.9982 1.0088 1.0062 1.0045 0.9971 1.0030 1.0011 0.9911 0.9895 0.9811 0.9850 1.0222 0.9968 0.9951 1.0357 1.0337 1.0234 1.0066 1.0058 1.0176 1.0055 1.0080 1.0068
dispcorr: -0.023885019 hartree
energy: -970.298696314613
dipole: -17.62494 17.56890 -0.05603 9.91823 -9.61570 0.30253 -1.12083 0.15162 -0.96921
magnitude: 1.01687 au
magnitude: 2.58468 debye
