program: Orca
programVersion: 5.0.2
elementType: O O O C C C C C C C C C C C C C C C C C C C H H H H H H H H H H H H H H H H H H H H H H H H H H H H H H H H H H
charge: 0
multiplicity: 1
keywords: wb97x-d3
keywords: def2-TZVPP
keywords: def2/J RIJCOSX
keywords: DEFGRID2
keywords: scfconv7
keywords: smallprint printgap noloewdin
keywords: NOSOSCF
formula: C19H34O3
InChI: InChI=1/C19H34O3/c1-15(2)22-18(20)14-17(4)11-8-10-16(3)12-9-13-19(5,6)21-7/h8,11,14-16H,9-10,12-13H2,1-7H3
56 atoms
O  -4.769186 3.644685 -0.685471
O  5.091615 -1.273027 -0.504427
O  4.441083 -2.380603 1.327766
C  -3.5059 1.074456 -0.017166
C  -2.917542 2.47086 0.156358
C  -2.441954 0.069794 -0.446129
C  -3.913041 3.596228 0.457955
C  -2.979908 -1.329052 -0.743007
C  -1.900782 -2.204848 -1.40607
C  -3.139068 4.904303 0.615442
C  -4.70006 3.307561 1.735003
C  -3.57031 -2.000106 0.492466
C  -0.722402 -2.475442 -0.533417
C  -5.813847 4.588007 -0.671537
C  0.520116 -2.057052 -0.798987
C  1.688942 -2.296123 0.043873
C  1.48166 -3.071935 1.305593
C  2.864171 -1.791754 -0.392885
C  4.173678 -1.867782 0.259387
C  6.461302 -1.20678 -0.052585
C  7.309675 -1.060028 -1.296731
C  6.638606 -0.045152 0.906112
H  -4.30237 1.088478 -0.766916
H  -3.968344 0.74823 0.917803
H  -2.363131 2.741026 -0.749862
H  -2.179463 2.449749 0.963607
H  -1.666139 0.007535 0.32552
H  -1.942677 0.450621 -1.344159
H  -3.781722 -1.227762 -1.483426
H  -1.573355 -1.730441 -2.334915
H  -2.359666 -3.160844 -1.680999
H  -3.789271 5.74951 0.845273
H  -2.578428 5.143696 -0.290262
H  -2.424094 4.821029 1.434875
H  -5.357066 2.443576 1.626287
H  -4.013317 3.099039 2.556237
H  -5.313231 4.156863 2.040328
H  -3.887079 -3.021892 0.274433
H  -4.445403 -1.463844 0.859795
H  -2.85016 -2.044959 1.31231
H  -0.915153 -3.048508 0.368418
H  -6.343203 4.492887 -1.620003
H  -5.46065 5.620832 -0.592099
H  -6.537865 4.415444 0.130823
H  0.694318 -1.486886 -1.707559
H  1.072322 -4.057389 1.076511
H  2.389209 -3.208757 1.879653
H  0.748836 -2.569998 1.939951
H  2.861156 -1.257041 -1.335995
H  6.716441 -2.143206 0.448094
H  7.084128 -0.134858 -1.829861
H  8.362574 -1.034365 -1.017385
H  7.168685 -1.897737 -1.980172
H  6.019713 -0.14667 1.797238
H  6.397151 0.90313 0.423073
H  7.677751 0.001703 1.232734
elementType: O C H
totalener: -970.27396772 hartree
nucrepener: 1762.52245868 hartree
electener: -2732.79642640 hartree
oneelecener: -4817.91308135 hartree
twoeener: 2085.11665495 hartree
cpcmener: -0.02798141 hartree
kineticenergy: 965.60864082 hartree
xcener: -96.763867542799 hartree
chargesum: 0.0000000
charge: -0.416700 -0.299560 -0.518169 -0.136544 -0.151530 -0.198682 0.339650 0.127012 -0.133829 -0.335456 -0.381007 -0.339731 -0.139029 -0.117191 -0.158170 0.018368 -0.264652 -0.184729 0.489376 0.159034 -0.254794 -0.263792 0.062223 0.075400 0.077579 0.077078 0.071485 0.075294 0.041392 0.086028 0.099939 0.099918 0.099340 0.098375 0.102664 0.105198 0.105580 0.099088 0.096200 0.083973 0.131017 0.117477 0.089647 0.092500 0.115051 0.107367 0.107662 0.106237 0.116142 0.062769 0.088744 0.090748 0.097222 0.093073 0.090173 0.097541
qa: -0.4167 -0.2996 -0.5182 -0.1365 -0.1515 -0.1987 0.3397 0.1270 -0.1338 -0.3355 -0.3810 -0.3397 -0.1390 -0.1172 -0.1582 0.0184 -0.2647 -0.1847 0.4894 0.1590 -0.2548 -0.2638 0.0622 0.0754 0.0776 0.0771 0.0715 0.0753 0.0414 0.0860 0.0999 0.0999 0.0993 0.0984 0.1027 0.1052 0.1056 0.0991 0.0962 0.0840 0.1310 0.1175 0.0896 0.0925 0.1151 0.1074 0.1077 0.1062 0.1161 0.0628 0.0887 0.0907 0.0972 0.0931 0.0902 0.0975
va: 1.9331 2.1237 1.9768 3.8731 3.7576 3.9322 3.8171 3.7409 3.9170 3.9260 3.9464 3.9605 3.8615 3.9222 3.9089 3.6999 3.9206 3.7843 4.1433 3.8126 3.9329 3.9067 1.0338 1.0016 1.0250 1.0153 1.0054 1.0125 1.0190 1.0133 1.0048 1.0019 1.0090 1.0049 0.9984 1.0023 0.9988 1.0028 1.0013 0.9963 0.9926 0.9916 0.9833 0.9814 1.0228 0.9956 1.0355 0.9961 1.0338 1.0236 1.0068 1.0052 1.0083 1.0171 1.0066 1.0057
dispcorr: -0.023629674 hartree
energy: -970.297597394927
dipole: -19.65746 18.74348 -0.91398 14.00344 -13.25271 0.75073 3.35619 -3.50302 -0.14683
magnitude: 1.19186 au
magnitude: 3.02946 debye
