program: Orca
programVersion: 5.0.2
elementType: O O O C C C C C C C C C C C C C C C C C C C H H H H H H H H H H H H H H H H H H H H H H H H H H H H H H H H H H
charge: 0
multiplicity: 1
keywords: wb97x-d3
keywords: def2-TZVPP
keywords: def2/J RIJCOSX
keywords: DEFGRID2
keywords: scfconv7
keywords: smallprint printgap noloewdin
keywords: NOSOSCF
formula: C19H34O3
InChI: InChI=1/C19H34O3/c1-15(2)22-18(20)14-17(4)11-8-10-16(3)12-9-13-19(5,6)21-7/h8,11,14-16H,9-10,12-13H2,1-7H3
56 atoms
O  -5.296932 3.575502 -0.632541
O  5.193055 -1.153443 -0.290703
O  4.47035 -2.086484 1.610921
C  -3.689901 1.115114 -0.078438
C  -3.209429 2.544714 0.141502
C  -2.534967 0.181175 -0.424693
C  -4.304336 3.591207 0.396659
C  -2.95815 -1.255534 -0.728219
C  -1.788042 -2.06449 -1.314832
C  -3.661272 4.971481 0.524337
C  -5.072923 3.277008 1.674708
C  -3.570572 -1.949975 0.483808
C  -0.642161 -2.245603 -0.378611
C  -4.870562 3.898715 -1.93545
C  0.608031 -1.842332 -0.631591
C  1.749198 -2.026261 0.261988
C  1.491146 -2.683729 1.579782
C  2.947223 -1.588314 -0.184814
C  4.241415 -1.654561 0.498518
C  6.562744 -1.130201 0.166543
C  7.208662 -2.484693 -0.049623
C  7.24869 -0.032186 -0.61742
H  -4.425822 1.083259 -0.888051
H  -4.202547 0.75464 0.816907
H  -2.60171 2.853407 -0.71593
H  -2.529033 2.567294 0.998471
H  -1.806133 0.182081 0.394002
H  -2.008714 0.584615 -1.297097
H  -3.722503 -1.219506 -1.51283
H  -1.442608 -1.587655 -2.235887
H  -2.166681 -3.054515 -1.593171
H  -3.017826 5.002623 1.404445
H  -4.416546 5.751497 0.639084
H  -3.039155 5.224295 -0.335872
H  -4.391325 3.214135 2.523145
H  -5.803623 4.058046 1.893651
H  -5.608535 2.329166 1.607106
H  -4.50428 -1.476262 0.787632
H  -2.900433 -1.927312 1.345847
H  -3.795875 -2.996083 0.267136
H  -0.862386 -2.751665 0.556176
H  -4.53866 4.937422 -2.031031
H  -5.727177 3.763131 -2.59605
H  -4.065799 3.252996 -2.300406
H  0.814221 -1.342559 -1.574209
H  1.083953 -3.684634 1.426457
H  2.375521 -2.769913 2.197302
H  0.738883 -2.123138 2.137081
H  2.979557 -1.135552 -1.169086
H  6.578774 -0.876846 1.228912
H  8.245373 -2.45042 0.285875
H  6.708969 -3.274461 0.510374
H  7.207496 -2.755652 -1.106593
H  6.777761 0.936184 -0.446551
H  7.239921 -0.238829 -1.688814
H  8.288703 0.045364 -0.301307
elementType: O C H
totalener: -970.27482603 hartree
nucrepener: 1762.74209985 hartree
electener: -2733.01692588 hartree
oneelecener: -4817.98485235 hartree
twoeener: 2084.96792647 hartree
cpcmener: -0.02874208 hartree
kineticenergy: 965.60612332 hartree
xcener: -96.763634764214 hartree
chargesum: 0.0000000
charge: -0.436567 -0.299092 -0.518471 -0.148939 -0.248274 -0.201088 0.394245 0.123798 -0.130355 -0.335663 -0.326243 -0.339633 -0.147984 -0.123644 -0.153341 0.018463 -0.264850 -0.185240 0.489216 0.157604 -0.262375 -0.254948 0.068484 0.084157 0.087528 0.093344 0.073283 0.076519 0.042173 0.085039 0.099411 0.099723 0.102621 0.098834 0.092015 0.101127 0.095291 0.096305 0.083496 0.099814 0.133637 0.094886 0.123512 0.089259 0.115764 0.107243 0.107934 0.105667 0.116044 0.063280 0.097313 0.092459 0.089884 0.097828 0.089104 0.090404
qa: -0.4366 -0.2991 -0.5185 -0.1489 -0.2483 -0.2011 0.3942 0.1238 -0.1304 -0.3357 -0.3262 -0.3396 -0.1480 -0.1236 -0.1533 0.0185 -0.2648 -0.1852 0.4892 0.1576 -0.2624 -0.2549 0.0685 0.0842 0.0875 0.0933 0.0733 0.0765 0.0422 0.0850 0.0994 0.0997 0.1026 0.0988 0.0920 0.1011 0.0953 0.0963 0.0835 0.0998 0.1336 0.0949 0.1235 0.0893 0.1158 0.1072 0.1079 0.1057 0.1160 0.0633 0.0973 0.0925 0.0899 0.0978 0.0891 0.0904
va: 1.9006 2.1236 1.9762 3.8748 3.8333 3.9243 3.7637 3.7434 3.9114 3.9187 3.9121 3.9593 3.8734 3.9221 3.9082 3.7009 3.9201 3.7833 4.1435 3.8138 3.9054 3.9330 1.0182 1.0030 1.0018 1.0116 1.0064 1.0121 1.0186 1.0133 1.0042 1.0050 1.0079 0.9983 1.0045 1.0088 1.0062 1.0012 0.9969 1.0028 0.9913 0.9850 0.9895 0.9811 1.0223 0.9953 1.0357 0.9965 1.0337 1.0232 1.0059 1.0178 1.0066 1.0080 1.0068 1.0055
dispcorr: -0.023900818 hartree
energy: -970.298726844343
dipole: -17.34644 17.29025 -0.05619 10.23100 -9.89428 0.33671 -1.00602 0.04605 -0.95997
magnitude: 1.01886 au
magnitude: 2.58974 debye
