program: Orca
programVersion: 5.0.2
elementType: O O O C C C C C C C C C C C C C C C C C C C H H H H H H H H H H H H H H H H H H H H H H H H H H H H H H H H H H
charge: 0
multiplicity: 1
keywords: wb97x-d3
keywords: def2-TZVPP
keywords: def2/J RIJCOSX
keywords: DEFGRID2
keywords: scfconv7
keywords: smallprint printgap noloewdin
keywords: NOSOSCF
formula: C19H34O3
InChI: InChI=1/C19H34O3/c1-15(2)22-18(20)14-17(4)11-8-10-16(3)12-9-13-19(5,6)21-7/h8,11,14-16H,9-10,12-13H2,1-7H3
56 atoms
O  -5.846519 2.558578 -1.339395
O  5.415885 -2.173177 -0.129056
O  5.04663 -0.136954 0.723672
C  -3.646156 0.943014 -0.15395
C  -4.201818 2.226871 0.450555
C  -3.06808 0.015959 0.909156
C  -4.851595 3.205074 -0.540514
C  -2.645766 -1.360652 0.392976
C  -1.604395 -1.301119 -0.739275
C  -3.830757 3.725099 -1.546306
C  -5.441891 4.385075 0.229785
C  -2.155641 -2.237112 1.539029
C  -0.318274 -0.660373 -0.342334
C  -6.961378 2.026804 -0.662089
C  0.862364 -1.289257 -0.354955
C  2.142591 -0.698543 0.026878
C  2.133579 0.717659 0.505039
C  3.232136 -1.488487 -0.094944
C  4.624421 -1.157775 0.218255
C  6.838952 -2.084954 0.102368
C  7.159556 -2.463454 1.535066
C  7.485553 -3.01947 -0.897043
H  -2.876212 1.185712 -0.891075
H  -4.432792 0.409804 -0.697569
H  -3.396551 2.764357 0.961065
H  -4.920754 1.970644 1.235863
H  -3.819113 -0.135159 1.692028
H  -2.221546 0.504967 1.404062
H  -3.534748 -1.835371 -0.037769
H  -2.026944 -0.748067 -1.584115
H  -1.414435 -2.315888 -1.098448
H  -3.420088 2.925949 -2.164766
H  -2.999622 4.206796 -1.031351
H  -4.280825 4.464009 -2.212065
H  -5.968836 5.070072 -0.437652
H  -6.135355 4.069376 1.010975
H  -4.644914 4.948069 0.717022
H  -1.285742 -1.801023 2.035065
H  -1.870732 -3.231533 1.189766
H  -2.932653 -2.363424 2.294915
H  -0.371663 0.378937 -0.031436
H  -7.56686 1.502909 -1.40256
H  -7.589985 2.797502 -0.204761
H  -6.691627 1.305335 0.115528
H  0.893769 -2.326662 -0.676823
H  3.113794 1.083783 0.782032
H  1.732674 1.372019 -0.27098
H  1.473997 0.818797 1.368629
H  3.081303 -2.492797 -0.474414
H  7.168835 -1.062628 -0.094795
H  6.686794 -1.796079 2.255217
H  6.843253 -3.485394 1.750276
H  8.23679 -2.40678 1.693081
H  7.247933 -2.737119 -1.922927
H  7.172702 -4.052826 -0.739343
H  8.568613 -2.978507 -0.785092
elementType: O C H
totalener: -970.27503255 hartree
nucrepener: 1765.35438073 hartree
electener: -2735.62941327 hartree
oneelecener: -4823.11015765 hartree
twoeener: 2087.48074437 hartree
cpcmener: -0.02901613 hartree
kineticenergy: 965.60495050 hartree
xcener: -96.763680104411 hartree
chargesum: 0.0000000
charge: -0.437860 -0.298815 -0.518368 -0.146436 -0.252498 -0.201708 0.396013 0.109943 -0.134997 -0.327982 -0.334055 -0.337405 -0.142198 -0.122666 -0.162120 0.024451 -0.266632 -0.185122 0.486599 0.158066 -0.263523 -0.255152 0.080102 0.075784 0.093469 0.087855 0.080468 0.074597 0.044484 0.101652 0.093649 0.096950 0.091861 0.101672 0.102755 0.098618 0.099738 0.084158 0.096639 0.095939 0.131455 0.123848 0.094960 0.087960 0.114370 0.107636 0.107652 0.106619 0.116090 0.063336 0.093637 0.090114 0.097464 0.097286 0.089002 0.090645
qa: -0.4379 -0.2988 -0.5184 -0.1464 -0.2525 -0.2017 0.3960 0.1099 -0.1350 -0.3280 -0.3341 -0.3374 -0.1422 -0.1227 -0.1621 0.0245 -0.2666 -0.1851 0.4866 0.1581 -0.2635 -0.2552 0.0801 0.0758 0.0935 0.0879 0.0805 0.0746 0.0445 0.1017 0.0936 0.0969 0.0919 0.1017 0.1028 0.0986 0.0997 0.0842 0.0966 0.0959 0.1315 0.1238 0.0950 0.0880 0.1144 0.1076 0.1077 0.1066 0.1161 0.0633 0.0936 0.0901 0.0975 0.0973 0.0890 0.0906
va: 1.8983 2.1242 1.9767 3.8532 3.8351 3.8805 3.7574 3.7707 3.9173 3.9125 3.9197 3.9539 3.8709 3.9226 3.9136 3.7042 3.9210 3.7890 4.1434 3.8123 3.9067 3.9321 1.0029 1.0158 1.0106 1.0020 1.0134 1.0043 1.0155 1.0009 1.0115 1.0062 1.0051 1.0088 1.0077 0.9983 1.0053 0.9986 1.0034 1.0051 0.9921 0.9890 0.9852 0.9816 1.0245 1.0357 0.9951 0.9966 1.0338 1.0235 1.0167 1.0065 1.0058 1.0082 1.0069 1.0053
dispcorr: -0.024265282 hartree
energy: -970.299297829659
dipole: -20.79198 19.84637 -0.94560 5.24690 -5.77922 -0.53231 3.62828 -3.26273 0.36555
magnitude: 1.14505 au
magnitude: 2.91050 debye
