program: Orca
programVersion: 5.0.2
elementType: O O O C C C C C C C C C C C C C C C C C C C H H H H H H H H H H H H H H H H H H H H H H H H H H H H H H H H H H
charge: 0
multiplicity: 1
keywords: wb97x-d3
keywords: def2-TZVPP
keywords: def2/J RIJCOSX
keywords: DEFGRID2
keywords: scfconv7
keywords: smallprint printgap noloewdin
keywords: NOSOSCF
formula: C19H34O3
InChI: InChI=1/C19H34O3/c1-15(2)22-18(20)14-17(4)11-8-10-16(3)12-9-13-19(5,6)21-7/h8,11,14-16H,9-10,12-13H2,1-7H3
56 atoms
O  -3.030417 2.86846 -1.548852
O  4.340029 -1.882691 0.322417
O  4.277485 0.210904 -0.468487
C  -3.446647 0.501765 0.198558
C  -3.551944 1.94893 0.664512
C  -2.941312 -0.417518 1.303603
C  -3.909395 2.969454 -0.426212
C  -2.900879 -1.8979 0.926828
C  -2.026439 -2.167768 -0.310013
C  -3.880892 4.378141 0.165714
C  -5.295798 2.693537 -0.997238
C  -2.469411 -2.746661 2.118128
C  -0.618122 -1.691192 -0.181564
C  -1.65331 3.029432 -1.299679
C  -0.039046 -0.82978 -1.023762
C  1.349352 -0.357967 -0.948804
C  1.549651 1.019557 -1.497545
C  2.302325 -1.160086 -0.431334
C  3.71365 -0.834741 -0.214929
C  5.749451 -1.795001 0.624941
C  5.961509 -1.079252 1.944951
C  6.261504 -3.218965 0.660092
H  -2.777373 0.439575 -0.663225
H  -4.421505 0.143984 -0.146636
H  -2.610523 2.24134 1.14202
H  -4.309845 2.024236 1.450009
H  -3.57962 -0.302013 2.185598
H  -1.940881 -0.094922 1.614781
H  -3.917712 -2.202142 0.654324
H  -2.481783 -1.7271 -1.199329
H  -2.008865 -3.250336 -0.47999
H  -4.647265 4.476731 0.935375
H  -4.080987 5.13098 -0.598916
H  -2.924487 4.61494 0.634678
H  -6.042027 2.698437 -0.202611
H  -5.579646 3.458673 -1.722346
H  -5.347503 1.724981 -1.496001
H  -3.156479 -2.618345 2.956093
H  -1.472939 -2.475683 2.472809
H  -2.453547 -3.808491 1.865853
H  -0.04604 -2.080118 0.656391
H  -1.139421 2.900204 -2.252559
H  -1.253233 2.287094 -0.601674
H  -1.40056 4.023254 -0.916067
H  -0.638507 -0.39705 -1.820986
H  1.028377 1.109498 -2.452256
H  1.092388 1.753343 -0.829006
H  2.587114 1.293332 -1.644204
H  2.018657 -2.161324 -0.131032
H  6.25083 -1.250478 -0.178569
H  5.462201 -1.606503 2.75931
H  7.027197 -1.046608 2.172327
H  5.598522 -0.052507 1.923173
H  7.334899 -3.214579 0.84643
H  6.091673 -3.731586 -0.287122
H  5.786808 -3.794525 1.456503
elementType: O C H
totalener: -970.27199362 hartree
nucrepener: 1851.36272400 hartree
electener: -2821.63471762 hartree
oneelecener: -4995.18241013 hartree
twoeener: 2173.54769252 hartree
cpcmener: -0.02873030 hartree
kineticenergy: 965.60938716 hartree
xcener: -96.764530194914 hartree
chargesum: -0.0000000
charge: -0.434087 -0.301197 -0.519770 -0.159344 -0.245139 -0.170072 0.384525 0.073907 -0.116245 -0.336802 -0.320600 -0.313030 -0.140171 -0.108623 -0.200924 0.095156 -0.296391 -0.238968 0.502483 0.160392 -0.264041 -0.256611 0.056022 0.084603 0.090886 0.094139 0.083582 0.072037 0.043510 0.090373 0.099478 0.099551 0.101084 0.099108 0.091105 0.101011 0.096544 0.092920 0.081820 0.093020 0.132924 0.125111 0.073873 0.098483 0.131392 0.112202 0.114249 0.110019 0.116616 0.062311 0.089614 0.097495 0.093189 0.091385 0.096769 0.089126
qa: -0.4341 -0.3012 -0.5198 -0.1593 -0.2451 -0.1701 0.3845 0.0739 -0.1162 -0.3368 -0.3206 -0.3130 -0.1402 -0.1086 -0.2009 0.0952 -0.2964 -0.2390 0.5025 0.1604 -0.2640 -0.2566 0.0560 0.0846 0.0909 0.0941 0.0836 0.0720 0.0435 0.0904 0.0995 0.0996 0.1011 0.0991 0.0911 0.1010 0.0965 0.0929 0.0818 0.0930 0.1329 0.1251 0.0739 0.0985 0.1314 0.1122 0.1142 0.1100 0.1166 0.0623 0.0896 0.0975 0.0932 0.0914 0.0968 0.0891
va: 1.9131 2.1220 1.9747 3.8528 3.8318 3.8876 3.7880 3.8088 3.8688 3.9188 3.9051 3.9480 3.8855 3.9245 3.9142 3.6263 3.9385 3.8410 4.1278 3.8138 3.9023 3.9351 1.0216 1.0130 1.0001 1.0128 1.0103 1.0066 1.0172 1.0070 1.0046 1.0048 1.0095 0.9991 1.0054 1.0086 1.0065 1.0040 1.0005 1.0049 0.9990 0.9890 0.9820 0.9846 0.9990 0.9963 0.9917 1.0327 1.0332 1.0228 1.0069 1.0057 1.0183 1.0051 1.0083 1.0065
dispcorr: -0.026508371 hartree
energy: -970.298501992072
dipole: -16.87059 16.04614 -0.82445 3.85470 -4.64166 -0.78696 7.94955 -6.89351 1.05604
magnitude: 1.55378 au
magnitude: 3.94941 debye
