program: Orca
programVersion: 5.0.2
elementType: O O O C C C C C C C C C C C C C C C C C C C H H H H H H H H H H H H H H H H H H H H H H H H H H H H H H H H H H
charge: 0
multiplicity: 1
keywords: wb97x-d3
keywords: def2-TZVPP
keywords: def2/J RIJCOSX
keywords: DEFGRID2
keywords: scfconv7
keywords: smallprint printgap noloewdin
keywords: NOSOSCF
formula: C19H34O3
InChI: InChI=1/C19H34O3/c1-15(2)22-18(20)14-17(4)11-8-10-16(3)12-9-13-19(5,6)21-7/h8,11,14-16H,9-10,12-13H2,1-7H3
56 atoms
O  -1.713911 3.847875 1.205444
O  3.773898 0.001814 -0.490712
O  3.590823 -1.757286 0.881722
C  -3.154868 0.590324 -0.166571
C  -2.643026 1.635623 0.819074
C  -3.603695 -0.679228 0.546874
C  -2.002176 2.879312 0.188795
C  -4.028058 -1.820833 -0.377002
C  -2.912319 -2.220348 -1.36438
C  -2.982588 3.593122 -0.733768
C  -0.736551 2.515923 -0.589333
C  -4.503973 -3.016464 0.441204
C  -1.609774 -2.489366 -0.69015
C  -0.79185 3.483069 2.20701
C  -0.501386 -1.7701 -0.899786
C  0.77264 -1.957806 -0.212051
C  0.868726 -3.086492 0.763128
C  1.752086 -1.074968 -0.507919
C  3.104993 -1.017771 0.049033
C  5.148337 0.230627 -0.107219
C  6.066368 -0.681022 -0.898736
C  5.426346 1.694738 -0.371402
H  -2.367338 0.349213 -0.882728
H  -3.989137 0.988517 -0.751098
H  -1.909478 1.148292 1.469805
H  -3.467223 1.955996 1.465731
H  -4.437434 -0.438849 1.214505
H  -2.79367 -1.030757 1.196519
H  -4.871103 -1.474695 -0.985235
H  -2.78175 -1.442762 -2.119648
H  -3.23638 -3.119858 -1.898329
H  -2.548183 4.515861 -1.123016
H  -3.907903 3.846161 -0.212139
H  -3.242725 2.970771 -1.588839
H  -0.986466 1.965712 -1.496197
H  -0.199413 3.415654 -0.895708
H  -0.051346 1.88962 -0.014881
H  -4.850329 -3.828286 -0.200716
H  -5.332881 -2.736836 1.093726
H  -3.71074 -3.41316 1.078339
H  -1.596272 -3.302322 0.029553
H  0.175179 3.164302 1.806798
H  -1.161424 2.692643 2.867473
H  -0.619028 4.369092 2.818669
H  -0.53696 -0.955361 -1.618232
H  1.854745 -3.201265 1.193686
H  0.15712 -2.937899 1.577527
H  0.595522 -4.024644 0.278201
H  1.52963 -0.30645 -1.239555
H  5.256555 0.031124 0.961174
H  5.979967 -0.490211 -1.96949
H  7.10068 -0.495529 -0.608245
H  5.858977 -1.735255 -0.717428
H  4.753695 2.339881 0.194235
H  5.331609 1.936689 -1.431197
H  6.445637 1.929604 -0.065896
elementType: O C H
totalener: -970.27298974 hartree
nucrepener: 1882.65145048 hartree
electener: -2852.92444022 hartree
oneelecener: -5057.51294971 hartree
twoeener: 2204.58850949 hartree
cpcmener: -0.02894019 hartree
kineticenergy: 965.61673244 hartree
xcener: -96.767642906214 hartree
chargesum: 0.0000000
charge: -0.414389 -0.300454 -0.519051 -0.176595 -0.211906 -0.178255 0.394168 0.078085 -0.120392 -0.324100 -0.385928 -0.314390 -0.132778 -0.121461 -0.186932 0.048559 -0.268148 -0.207986 0.495657 0.159064 -0.263350 -0.256032 0.066669 0.087919 0.085617 0.085816 0.088126 0.070840 0.043905 0.091102 0.099088 0.100196 0.099685 0.092210 0.097476 0.112040 0.101070 0.092820 0.091659 0.082301 0.135958 0.090542 0.089792 0.120989 0.119701 0.107872 0.108737 0.105928 0.116981 0.062957 0.090115 0.097663 0.093111 0.097535 0.088918 0.091279
qa: -0.4144 -0.3005 -0.5191 -0.1766 -0.2119 -0.1783 0.3942 0.0781 -0.1204 -0.3241 -0.3859 -0.3144 -0.1328 -0.1215 -0.1869 0.0486 -0.2681 -0.2080 0.4957 0.1591 -0.2634 -0.2560 0.0667 0.0879 0.0856 0.0858 0.0881 0.0708 0.0439 0.0911 0.0991 0.1002 0.0997 0.0922 0.0975 0.1120 0.1011 0.0928 0.0917 0.0823 0.1360 0.0905 0.0898 0.1210 0.1197 0.1079 0.1087 0.1059 0.1170 0.0630 0.0901 0.0977 0.0931 0.0975 0.0889 0.0913
va: 1.9379 2.1230 1.9748 3.9002 3.8519 3.8939 3.8041 3.7964 3.8883 3.9043 3.9397 3.9500 3.8303 3.9295 3.9202 3.6356 3.9221 3.7814 4.1456 3.8116 3.9068 3.9338 1.0042 1.0094 1.0051 1.0196 1.0099 1.0059 1.0175 1.0058 1.0059 1.0122 1.0084 0.9992 1.0007 1.0122 0.9907 1.0054 1.0045 1.0007 0.9904 0.9807 0.9807 0.9903 1.0174 1.0349 0.9956 0.9967 1.0329 1.0239 1.0067 1.0057 1.0172 1.0080 1.0066 1.0052
dispcorr: -0.026545954 hartree
energy: -970.299535694743
dipole: -12.70833 12.02112 -0.68721 4.34852 -4.76998 -0.42146 -0.73020 -0.01744 -0.74764
magnitude: 1.09948 au
magnitude: 2.79466 debye
