program: Orca
programVersion: 5.0.2
elementType: O O O C C C C C C C C C C C C C C C C C C C H H H H H H H H H H H H H H H H H H H H H H H H H H H H H H H H H H
charge: 0
multiplicity: 1
keywords: wb97x-d3
keywords: def2-TZVPP
keywords: def2/J RIJCOSX
keywords: DEFGRID2
keywords: scfconv7
keywords: smallprint printgap noloewdin
keywords: NOSOSCF
formula: C19H34O3
InChI: InChI=1/C19H34O3/c1-15(2)22-18(20)14-17(4)11-8-10-16(3)12-9-13-19(5,6)21-7/h8,11,14-16H,9-10,12-13H2,1-7H3
56 atoms
O  -0.589968 1.841214 0.927517
O  3.590544 -0.055081 0.482852
O  3.255257 -0.510989 -1.681295
C  -2.939269 0.332451 -0.048902
C  -2.906787 1.738444 0.542757
C  -3.992591 -0.561585 0.597428
C  -1.632336 2.533893 0.233072
C  -4.118702 -1.97393 0.01343
C  -2.901402 -2.87475 0.302895
C  -1.779832 3.951641 0.781141
C  -1.372642 2.584591 -1.271212
C  -5.376857 -2.645703 0.553931
C  -1.684163 -2.5304 -0.484069
C  0.7358 2.247242 0.679721
C  -0.498541 -2.206446 0.042766
C  0.646927 -1.722998 -0.720331
C  0.542564 -1.750004 -2.212213
C  1.681443 -1.222757 -0.008243
C  2.894117 -0.585363 -0.523625
C  4.806368 0.671348 0.198932
C  4.966659 1.686597 1.309289
C  5.975209 -0.28946 0.116292
H  -1.958775 -0.121967 0.066745
H  -3.124366 0.382273 -1.126294
H  -3.01027 1.679766 1.632423
H  -3.768102 2.312438 0.189536
H  -4.968657 -0.070553 0.513626
H  -3.791645 -0.642589 1.672358
H  -4.223347 -1.888799 -1.075258
H  -3.184651 -3.903042 0.049799
H  -2.682051 -2.865319 1.374935
H  -1.978602 3.941239 1.854425
H  -2.611914 4.461608 0.29436
H  -0.888678 4.556677 0.607365
H  -1.132939 1.601515 -1.680646
H  -2.26051 2.949661 -1.789208
H  -0.553816 3.259771 -1.524992
H  -6.267204 -2.054463 0.333702
H  -5.323116 -2.767934 1.638567
H  -5.521689 -3.635726 0.11813
H  -1.818711 -2.513409 -1.562005
H  0.899786 3.315517 0.85316
H  1.071792 2.015229 -0.336208
H  1.371827 1.700615 1.375894
H  -0.391805 -2.202735 1.124107
H  -0.240453 -1.063198 -2.541535
H  1.461742 -1.47375 -2.712364
H  0.252033 -2.743618 -2.554928
H  1.603667 -1.243292 1.072833
H  4.691758 1.197964 -0.750585
H  4.112781 2.364448 1.355637
H  5.084404 1.206682 2.282109
H  5.856568 2.287579 1.124192
H  5.850865 -1.020913 -0.682032
H  6.11199 -0.82427 1.057529
H  6.890645 0.266417 -0.087658
elementType: O C H
totalener: -970.27215564 hartree
nucrepener: 1937.77487833 hartree
electener: -2908.04703398 hartree
oneelecener: -5168.76104016 hartree
twoeener: 2260.71400619 hartree
cpcmener: -0.02793683 hartree
kineticenergy: 965.61464467 hartree
xcener: -96.766324631952 hartree
chargesum: -0.0000000
charge: -0.418771 -0.299541 -0.520401 -0.006920 -0.226816 -0.197303 0.362033 0.091213 -0.113297 -0.331940 -0.379548 -0.304682 -0.119538 -0.143826 -0.162079 0.031785 -0.267155 -0.221529 0.499082 0.155871 -0.258719 -0.262494 -0.010642 0.073940 0.075799 0.080805 0.073340 0.067263 0.039741 0.094103 0.081766 0.097245 0.097343 0.098284 0.098106 0.108801 0.106218 0.089431 0.084966 0.090761 0.125843 0.111014 0.104917 0.112795 0.119362 0.104874 0.110193 0.109709 0.121105 0.063640 0.096553 0.090596 0.095226 0.093429 0.090313 0.097739
qa: -0.4188 -0.2995 -0.5204 -0.0069 -0.2268 -0.1973 0.3620 0.0912 -0.1133 -0.3319 -0.3795 -0.3047 -0.1195 -0.1438 -0.1621 0.0318 -0.2672 -0.2215 0.4991 0.1559 -0.2587 -0.2625 -0.0106 0.0739 0.0758 0.0808 0.0733 0.0673 0.0397 0.0941 0.0818 0.0972 0.0973 0.0983 0.0981 0.1088 0.1062 0.0894 0.0850 0.0908 0.1258 0.1110 0.1049 0.1128 0.1194 0.1049 0.1102 0.1097 0.1211 0.0636 0.0966 0.0906 0.0952 0.0934 0.0903 0.0977
va: 1.9215 2.1141 1.9705 3.7640 3.8575 3.9492 3.7871 3.7560 3.9021 3.9330 3.9579 3.9340 3.8582 3.9156 3.9003 3.6569 3.9210 3.7775 4.1155 3.8099 3.9325 3.9146 1.0810 1.0087 1.0240 1.0144 1.0078 1.0101 1.0239 1.0031 1.0149 1.0098 1.0050 1.0051 0.9919 1.0030 0.9992 1.0048 1.0007 1.0047 1.0050 0.9864 0.9770 0.9953 1.0223 0.9941 1.0345 0.9994 1.0316 1.0250 1.0041 1.0062 1.0069 1.0159 1.0066 1.0061
dispcorr: -0.028793689 hartree
energy: -970.300949329943
dipole: -13.66240 12.75351 -0.90889 8.21688 -7.71083 0.50605 2.12349 -1.93397 0.18951
magnitude: 1.05739 au
magnitude: 2.68767 debye
