program: Orca
programVersion: 5.0.2
elementType: O O O C C C C C C C C C C C C C C C C C C C H H H H H H H H H H H H H H H H H H H H H H H H H H H H H H H H H H
charge: 0
multiplicity: 1
keywords: wb97x-d3
keywords: def2-TZVPP
keywords: def2/J RIJCOSX
keywords: DEFGRID2
keywords: scfconv7
keywords: smallprint printgap noloewdin
keywords: NOSOSCF
formula: C19H34O3
InChI: InChI=1/C19H34O3/c1-15(2)22-18(20)14-17(4)11-8-10-16(3)12-9-13-19(5,6)21-7/h8,11,14-16H,9-10,12-13H2,1-7H3
56 atoms
O  -6.744879 2.426256 0.659559
O  5.702801 -2.658404 -0.097998
O  5.741908 -0.49932 -0.684271
C  -4.573803 0.463313 0.237739
C  -4.520647 1.976728 0.049513
C  -3.359626 -0.082809 0.985774
C  -5.822774 2.640518 -0.411518
C  -2.001381 0.176697 0.331564
C  -0.887222 -0.33567 1.254102
C  -6.31902 2.022372 -1.71742
C  -5.568897 4.133467 -0.613712
C  -1.902695 -0.452133 -1.051769
C  0.478465 0.019705 0.77718
C  -8.066248 2.876947 0.475431
C  1.479717 -0.853029 0.62045
C  2.829931 -0.514545 0.177837
C  3.098162 0.912611 -0.178517
C  3.72584 -1.525632 0.135408
C  5.134313 -1.462805 -0.261705
C  7.101235 -2.832661 -0.415427
C  7.962184 -2.36966 0.744033
C  7.28593 -4.304446 -0.71502
H  -4.670722 -0.03416 -0.730796
H  -5.465934 0.188177 0.805283
H  -3.744183 2.229935 -0.677457
H  -4.215036 2.44688 0.991562
H  -3.481511 -1.163281 1.120311
H  -3.349191 0.348732 1.99259
H  -1.863499 1.259231 0.227035
H  -0.975296 -1.418828 1.383308
H  -1.031961 0.112849 2.24415
H  -7.166471 2.568816 -2.134694
H  -6.62079 0.981519 -1.591297
H  -5.524039 2.048146 -2.464188
H  -4.805918 4.284525 -1.378245
H  -6.461958 4.665802 -0.94521
H  -5.215537 4.603294 0.306419
H  -0.927484 -0.271361 -1.507174
H  -2.653899 -0.051953 -1.734089
H  -2.045823 -1.53456 -0.999277
H  0.639265 1.072597 0.561691
H  -8.611999 2.650237 1.391707
H  -8.580296 2.373432 -0.349133
H  -8.135107 3.956368 0.30819
H  1.297626 -1.900504 0.844229
H  2.421785 1.235391 -0.971679
H  2.900766 1.556334 0.680311
H  4.11355 1.090616 -0.507534
H  3.384901 -2.509539 0.436504
H  7.337929 -2.251313 -1.309327
H  9.013357 -2.525509 0.50038
H  7.829589 -1.310089 0.960889
H  7.741278 -2.938571 1.648526
H  6.663315 -4.625239 -1.550594
H  7.050241 -4.923251 0.152267
H  8.324647 -4.492125 -0.985957
elementType: O C H
totalener: -970.27452607 hartree
nucrepener: 1727.90301097 hartree
electener: -2698.17753704 hartree
oneelecener: -4748.45299907 hartree
twoeener: 2050.27546203 hartree
cpcmener: -0.02829525 hartree
kineticenergy: 965.60821457 hartree
xcener: -96.764197155228 hartree
chargesum: 0.0000000
charge: -0.414782 -0.299673 -0.518610 -0.155609 -0.138629 -0.196424 0.324467 0.089711 -0.113849 -0.374628 -0.333218 -0.334154 -0.156828 -0.118393 -0.136970 0.009347 -0.262281 -0.184845 0.490750 0.158859 -0.263445 -0.254569 0.074069 0.077652 0.073049 0.080962 0.082981 0.076930 0.050234 0.080276 0.095849 0.105078 0.104112 0.103927 0.096805 0.100243 0.099338 0.098226 0.096969 0.087239 0.127542 0.117992 0.092588 0.090359 0.115304 0.106463 0.106352 0.107098 0.115590 0.062818 0.097284 0.093351 0.090129 0.097341 0.088721 0.090901
qa: -0.4148 -0.2997 -0.5186 -0.1556 -0.1386 -0.1964 0.3245 0.0897 -0.1138 -0.3746 -0.3332 -0.3342 -0.1568 -0.1184 -0.1370 0.0093 -0.2623 -0.1848 0.4908 0.1589 -0.2634 -0.2546 0.0741 0.0777 0.0730 0.0810 0.0830 0.0769 0.0502 0.0803 0.0958 0.1051 0.1041 0.1039 0.0968 0.1002 0.0993 0.0982 0.0970 0.0872 0.1275 0.1180 0.0926 0.0904 0.1153 0.1065 0.1064 0.1071 0.1156 0.0628 0.0973 0.0934 0.0901 0.0973 0.0887 0.0909
va: 1.9369 2.1235 1.9757 3.8753 3.7140 3.9188 3.8583 3.7326 3.9097 3.9410 3.9216 3.9534 3.8969 3.9221 3.9117 3.7124 3.9203 3.7846 4.1440 3.8136 3.9057 3.9334 1.0010 1.0348 1.0158 1.0249 1.0095 1.0098 1.0203 1.0177 1.0055 0.9986 0.9977 1.0040 1.0051 1.0024 1.0090 1.0033 0.9999 1.0028 1.0038 0.9918 0.9820 0.9836 1.0227 0.9965 0.9954 1.0359 1.0337 1.0237 1.0057 1.0172 1.0067 1.0081 1.0068 1.0052
dispcorr: -0.023702681 hartree
energy: -970.298228748546
dipole: -25.20191 24.02596 -1.17595 7.03325 -7.09282 -0.05957 -3.06186 2.83256 -0.22930
magnitude: 1.19957 au
magnitude: 3.04907 debye
