program: Orca
programVersion: 5.0.2
elementType: O O O C C C C C C C C C C C C C C C C C C C H H H H H H H H H H H H H H H H H H H H H H H H H H H H H H H H H H
charge: 0
multiplicity: 1
keywords: wb97x-d3
keywords: def2-TZVPP
keywords: def2/J RIJCOSX
keywords: DEFGRID2
keywords: scfconv7
keywords: smallprint printgap noloewdin
keywords: NOSOSCF
formula: C19H34O3
InChI: InChI=1/C19H34O3/c1-15(2)22-18(20)14-17(4)11-8-10-16(3)12-9-13-19(5,6)21-7/h8,11,14-16H,9-10,12-13H2,1-7H3
56 atoms
O  -5.184741 2.550923 -0.663427
O  5.142924 -1.500452 0.738194
O  4.619717 -0.36164 -1.115914
C  -3.444779 0.985384 1.177376
C  -3.038032 1.869489 0.001687
C  -2.613568 -0.296169 1.24186
C  -3.921363 3.091216 -0.268785
C  -2.995619 -1.355153 0.204053
C  -1.881798 -2.399787 0.036272
C  -3.301565 3.899836 -1.407341
C  -4.046462 3.965383 0.977217
C  -4.303877 -2.04538 0.570069
C  -0.640147 -1.821799 -0.549664
C  -6.232878 3.462456 -0.893758
C  0.572574 -1.892342 0.009259
C  1.792828 -1.316646 -0.550331
C  1.671092 -0.551263 -1.829041
C  2.931855 -1.522488 0.146931
C  4.280939 -1.053567 -0.176365
C  6.546054 -1.184291 0.610884
C  7.126089 -1.263251 2.006612
C  7.209952 -2.153688 -0.347377
H  -4.508575 0.739425 1.125764
H  -3.308935 1.537402 2.110643
H  -3.000763 1.274355 -0.917034
H  -2.016295 2.223107 0.16906
H  -2.70056 -0.743994 2.237605
H  -1.558188 -0.027036 1.12738
H  -3.129995 -0.866555 -0.768172
H  -2.247956 -3.18687 -0.63271
H  -1.667077 -2.876594 0.997577
H  -3.193855 3.293186 -2.308869
H  -2.308567 4.24923 -1.122238
H  -3.889789 4.783229 -1.66104
H  -4.591827 3.463707 1.777991
H  -3.054428 4.213769 1.356999
H  -4.553654 4.908522 0.767346
H  -5.118087 -1.331661 0.702617
H  -4.201044 -2.605414 1.502673
H  -4.611994 -2.748128 -0.206033
H  -0.769115 -1.306673 -1.497624
H  -7.093374 2.882486 -1.228405
H  -6.003283 4.194405 -1.674215
H  -6.531262 4.009608 0.00559
H  0.680233 -2.412776 0.956893
H  0.97225 0.277606 -1.704449
H  2.612402 -0.15025 -2.181003
H  1.259391 -1.190784 -2.611587
H  2.862635 -2.10532 1.058037
H  6.648584 -0.163267 0.236844
H  7.038066 -2.26826 2.422192
H  8.184596 -1.006333 1.975009
H  6.636394 -0.562966 2.683753
H  7.11313 -3.181591 0.005539
H  8.273222 -1.923896 -0.419839
H  6.792156 -2.091815 -1.351854
elementType: O C H
totalener: -970.27366848 hartree
nucrepener: 1782.33737934 hartree
electener: -2752.61104782 hartree
oneelecener: -4857.51648763 hartree
twoeener: 2104.90543981 hartree
cpcmener: -0.02776036 hartree
kineticenergy: 965.61521523 hartree
xcener: -96.765051450162 hartree
chargesum: -0.0000000
charge: -0.415732 -0.299363 -0.518657 -0.143083 -0.156352 -0.183051 0.327576 0.051890 -0.111548 -0.332049 -0.375138 -0.314451 -0.128778 -0.119831 -0.159225 0.019974 -0.261603 -0.185746 0.491228 0.157661 -0.254739 -0.262960 0.066514 0.080402 0.082603 0.077045 0.087493 0.080875 0.050365 0.094748 0.080396 0.098095 0.096857 0.099704 0.103091 0.104279 0.105711 0.092422 0.082657 0.092659 0.123180 0.118495 0.090736 0.093164 0.115697 0.106467 0.106431 0.106955 0.115716 0.063311 0.088978 0.090942 0.097516 0.090382 0.096879 0.093212
qa: -0.4157 -0.2994 -0.5187 -0.1431 -0.1564 -0.1831 0.3276 0.0519 -0.1115 -0.3320 -0.3751 -0.3145 -0.1288 -0.1198 -0.1592 0.0200 -0.2616 -0.1857 0.4912 0.1577 -0.2547 -0.2630 0.0665 0.0804 0.0826 0.0770 0.0875 0.0809 0.0504 0.0947 0.0804 0.0981 0.0969 0.0997 0.1031 0.1043 0.1057 0.0924 0.0827 0.0927 0.1232 0.1185 0.0907 0.0932 0.1157 0.1065 0.1064 0.1070 0.1157 0.0633 0.0890 0.0909 0.0975 0.0904 0.0969 0.0932
va: 1.9329 2.1237 1.9764 3.8746 3.7519 3.9160 3.8397 3.7632 3.8991 3.9247 3.9416 3.9471 3.8761 3.9234 3.9009 3.7002 3.9200 3.7835 4.1446 3.8131 3.9328 3.9074 1.0317 1.0084 1.0259 1.0168 1.0098 1.0074 1.0225 1.0043 1.0156 1.0086 1.0052 1.0030 0.9971 1.0028 0.9982 1.0039 1.0026 1.0035 1.0066 0.9915 0.9834 0.9822 1.0226 0.9969 1.0360 0.9957 1.0338 1.0238 1.0066 1.0053 1.0081 1.0067 1.0060 1.0169
dispcorr: -0.024068636 hartree
energy: -970.297737115883
dipole: -19.67980 18.99895 -0.68084 8.59181 -8.38907 0.20274 2.96130 -2.28658 0.67472
magnitude: 0.97974 au
magnitude: 2.49031 debye
