program: Orca
programVersion: 5.0.2
elementType: O O O C C C C C C C C C C C C C C C C C C C H H H H H H H H H H H H H H H H H H H H H H H H H H H H H H H H H H
charge: 0
multiplicity: 1
keywords: wb97x-d3
keywords: def2-TZVPP
keywords: def2/J RIJCOSX
keywords: DEFGRID2
keywords: scfconv7
keywords: smallprint printgap noloewdin
keywords: NOSOSCF
formula: C19H34O3
InChI: InChI=1/C19H34O3/c1-15(2)22-18(20)14-17(4)11-8-10-16(3)12-9-13-19(5,6)21-7/h8,11,14-16H,9-10,12-13H2,1-7H3
56 atoms
O  -5.416286 2.81257 -0.116812
O  5.113462 -1.352122 0.738909
O  4.660398 -0.611465 -1.324491
C  -3.308348 1.155658 1.221888
C  -3.099716 2.016671 -0.020344
C  -2.473464 -0.123412 1.198076
C  -4.04572 3.216991 -0.162367
C  -2.950395 -1.19094 0.209877
C  -1.898383 -2.299908 0.050765
C  -3.73255 3.956169 -1.461949
C  -3.891973 4.177244 1.010953
C  -4.279627 -1.80063 0.63847
C  -0.646788 -1.817491 -0.59655
C  -5.859168 1.921498 -1.113398
C  0.566224 -1.866239 -0.03598
C  1.800454 -1.385265 -0.650852
C  1.704295 -0.791534 -2.019399
C  2.92778 -1.509573 0.083319
C  4.287303 -1.103843 -0.278356
C  6.519662 -1.049614 0.60975
C  7.043625 -0.878001 2.019326
C  7.228281 -2.164206 -0.134878
H  -4.366189 0.907543 1.341767
H  -3.036014 1.729843 2.111033
H  -3.170007 1.398201 -0.920245
H  -2.075248 2.401725 -0.018291
H  -2.459897 -0.567815 2.199363
H  -1.435552 0.146338 0.976516
H  -3.089584 -0.729388 -0.774874
H  -2.326639 -3.093292 -0.571826
H  -1.678575 -2.745393 1.025886
H  -3.775134 3.30217 -2.334521
H  -2.724714 4.371047 -1.421662
H  -4.425404 4.784467 -1.622938
H  -4.168361 3.713447 1.958794
H  -2.858358 4.513534 1.094104
H  -4.518392 5.061253 0.876589
H  -4.185747 -2.301856 1.604951
H  -4.626354 -2.539824 -0.085805
H  -5.064238 -1.049035 0.7327
H  -0.768349 -1.393613 -1.589554
H  -5.30035 0.980174 -1.133399
H  -5.828409 2.353405 -2.118725
H  -6.898584 1.681414 -0.888423
H  0.662337 -2.289754 0.9600
H  1.027314 0.064596 -2.008787
H  2.657601 -0.46432 -2.413403
H  1.278888 -1.516459 -2.715224
H  2.837263 -1.955491 1.066952
H  6.632068 -0.108877 0.065821
H  6.936108 -1.794916 2.600777
H  8.103344 -0.626428 1.985403
H  6.52893 -0.071963 2.543046
H  7.132856 -3.112699 0.395797
H  8.290229 -1.930271 -0.213267
H  6.846102 -2.294329 -1.14693
elementType: O C H
totalener: -970.27452163 hartree
nucrepener: 1790.95289404 hartree
electener: -2761.22741567 hartree
oneelecener: -4874.21922719 hartree
twoeener: 2112.99181152 hartree
cpcmener: -0.02887098 hartree
kineticenergy: 965.61819315 hartree
xcener: -96.766475614554 hartree
chargesum: 0.0000000
charge: -0.427898 -0.299089 -0.518771 -0.157525 -0.248888 -0.191625 0.375792 0.069728 -0.122104 -0.336812 -0.316597 -0.319283 -0.124305 -0.119756 -0.164705 0.021634 -0.264187 -0.185147 0.491272 0.157813 -0.255047 -0.263355 0.074234 0.088609 0.093908 0.091716 0.086805 0.081141 0.047013 0.096007 0.081001 0.098327 0.098754 0.102122 0.096912 0.091199 0.100166 0.087364 0.094002 0.089107 0.124010 0.081181 0.097984 0.123217 0.115854 0.107236 0.106534 0.107127 0.115983 0.063724 0.088962 0.090792 0.097131 0.090097 0.097708 0.092927
qa: -0.4279 -0.2991 -0.5188 -0.1575 -0.2489 -0.1916 0.3758 0.0697 -0.1221 -0.3368 -0.3166 -0.3193 -0.1243 -0.1198 -0.1647 0.0216 -0.2642 -0.1851 0.4913 0.1578 -0.2550 -0.2634 0.0742 0.0886 0.0939 0.0917 0.0868 0.0811 0.0470 0.0960 0.0810 0.0983 0.0988 0.1021 0.0969 0.0912 0.1002 0.0874 0.0940 0.0891 0.1240 0.0812 0.0980 0.1232 0.1159 0.1072 0.1065 0.1071 0.1160 0.0637 0.0890 0.0908 0.0971 0.0901 0.0977 0.0929
va: 1.9153 2.1237 1.9762 3.8720 3.8185 3.9193 3.7951 3.7487 3.9117 3.9139 3.9084 3.9484 3.8691 3.9222 3.9083 3.6964 3.9206 3.7826 4.1435 3.8133 3.9329 3.9056 1.0195 1.0097 0.9983 1.0147 1.0105 1.0075 1.0244 1.0047 1.0160 0.9992 1.0056 1.0084 1.0054 1.0049 1.0098 1.0036 1.0033 1.0028 1.0057 0.9781 0.9857 0.9895 1.0227 0.9959 1.0359 0.9961 1.0338 1.0229 1.0068 1.0052 1.0082 1.0066 1.0056 1.0176
dispcorr: -0.024906717 hartree
energy: -970.299428345597
dipole: -18.59302 18.25893 -0.33409 6.20767 -6.80633 -0.59866 1.74657 -1.59907 0.14750
magnitude: 0.70126 au
magnitude: 1.78246 debye
