program: Orca
programVersion: 5.0.2
elementType: O O O C C C C C C C C C C C C C C C C C C C H H H H H H H H H H H H H H H H H H H H H H H H H H H H H H H H H H
charge: 0
multiplicity: 1
keywords: wb97x-d3
keywords: def2-TZVPP
keywords: def2/J RIJCOSX
keywords: DEFGRID2
keywords: scfconv7
keywords: smallprint printgap noloewdin
keywords: NOSOSCF
formula: C19H34O3
InChI: InChI=1/C19H34O3/c1-15(2)22-18(20)14-17(4)11-8-10-16(3)12-9-13-19(5,6)21-7/h8,11,14-16H,9-10,12-13H2,1-7H3
56 atoms
O  -6.335398 3.001566 0.581092
O  5.56786 -2.14689 0.477607
O  5.122039 -1.482855 -1.612519
C  -4.112561 1.064323 1.105141
C  -4.392878 1.740706 -0.232376
C  -3.684412 -0.394201 0.961653
C  -5.112354 3.096138 -0.152612
C  -2.434623 -0.65685 0.119306
C  -1.202801 0.046125 0.707196
C  -5.355971 3.621569 -1.566444
C  -4.279619 4.109396 0.623425
C  -2.198937 -2.156941 -0.00857
C  0.014994 -0.135759 -0.130925
C  -7.3355 2.15989 0.057147
C  1.16429 -0.666828 0.300138
C  2.363429 -0.852118 -0.513199
C  2.288675 -0.449584 -1.951215
C  3.443242 -1.376062 0.108174
C  4.762487 -1.653636 -0.464318
C  6.940319 -2.457127 0.151571
C  7.781532 -1.195904 0.190567
C  7.396279 -3.480833 1.168747
H  -5.010774 1.086209 1.728026
H  -3.355597 1.625347 1.659979
H  -4.970791 1.058614 -0.865972
H  -3.454349 1.905176 -0.769895
H  -4.515358 -0.956731 0.522679
H  -3.528076 -0.819087 1.959396
H  -2.599961 -0.254989 -0.8871
H  -1.022825 -0.314321 1.724981
H  -1.406701 1.119865 0.781859
H  -5.898795 2.908585 -2.189536
H  -4.403208 3.818093 -2.059972
H  -5.918969 4.5571 -1.549892
H  -3.296701 4.224697 0.165913
H  -4.760589 5.089494 0.627624
H  -4.130382 3.806759 1.660914
H  -1.361506 -2.385423 -0.66947
H  -3.079965 -2.65862 -0.412638
H  -1.981257 -2.604223 0.964682
H  -0.075524 0.194197 -1.162244
H  -7.006731 1.123588 -0.069427
H  -7.729449 2.509529 -0.902528
H  -8.159273 2.158693 0.77147
H  1.233274 -0.992093 1.334526
H  3.207575 -0.626487 -2.494894
H  1.485916 -0.994466 -2.450915
H  2.043461 0.610751 -2.032967
H  3.347028 -1.619287 1.160094
H  6.978123 -2.898978 -0.846616
H  8.818477 -1.443257 -0.038138
H  7.452716 -0.456131 -0.538724
H  7.757395 -0.739587 1.181363
H  7.370052 -3.07822 2.182608
H  8.423592 -3.773766 0.953144
H  6.781996 -4.380925 1.135705
elementType: O C H
totalener: -970.27486930 hartree
nucrepener: 1753.69721858 hartree
electener: -2723.97208788 hartree
oneelecener: -4799.64022828 hartree
twoeener: 2075.66814040 hartree
cpcmener: -0.02907228 hartree
kineticenergy: 965.60507116 hartree
xcener: -96.764005886405 hartree
chargesum: -0.0000000
charge: -0.430989 -0.299861 -0.519284 -0.141847 -0.269500 -0.216335 0.387962 0.106149 -0.135915 -0.336503 -0.317980 -0.329996 -0.154636 -0.124133 -0.138652 0.011765 -0.263573 -0.186939 0.491105 0.159018 -0.263135 -0.254443 0.086243 0.081400 0.094385 0.091504 0.078211 0.083178 0.051880 0.085337 0.101381 0.098995 0.098961 0.102721 0.090620 0.100439 0.097540 0.095283 0.094576 0.086496 0.129911 0.089590 0.094347 0.123459 0.115311 0.107074 0.106290 0.106450 0.116037 0.063379 0.097202 0.092634 0.090139 0.088807 0.090830 0.097109
qa: -0.4310 -0.2999 -0.5193 -0.1418 -0.2695 -0.2163 0.3880 0.1061 -0.1359 -0.3365 -0.3180 -0.3300 -0.1546 -0.1241 -0.1387 0.0118 -0.2636 -0.1869 0.4911 0.1590 -0.2631 -0.2544 0.0862 0.0814 0.0944 0.0915 0.0782 0.0832 0.0519 0.0853 0.1014 0.0990 0.0990 0.1027 0.0906 0.1004 0.0975 0.0953 0.0946 0.0865 0.1299 0.0896 0.0943 0.1235 0.1153 0.1071 0.1063 0.1064 0.1160 0.0634 0.0972 0.0926 0.0901 0.0888 0.0908 0.0971
va: 1.9124 2.1241 1.9754 3.8414 3.8282 3.9282 3.7945 3.6976 3.9115 3.9156 3.9068 3.9441 3.8842 3.9214 3.9102 3.7123 3.9218 3.7841 4.1439 3.8131 3.9062 3.9326 1.0215 1.0024 0.9993 1.0087 1.0086 1.0081 1.0202 1.0169 1.0017 0.9985 1.0055 1.0078 1.0057 1.0097 1.0055 1.0010 1.0049 1.0034 1.0031 0.9826 0.9851 0.9897 1.0235 1.0360 0.9962 0.9958 1.0338 1.0232 1.0057 1.0175 1.0067 1.0067 1.0052 1.0082
dispcorr: -0.024358339 hartree
energy: -970.299227636419
dipole: -21.21518 20.49417 -0.72101 6.25149 -6.46849 -0.21700 0.79742 -0.67116 0.12625
magnitude: 0.76347 au
magnitude: 1.94060 debye
