program: Orca
programVersion: 5.0.2
elementType: O O O C C C C C C C C C C C C C C C C C C C H H H H H H H H H H H H H H H H H H H H H H H H H H H H H H H H H H
charge: 0
multiplicity: 1
keywords: wb97x-d3
keywords: def2-TZVPP
keywords: def2/J RIJCOSX
keywords: DEFGRID2
keywords: scfconv7
keywords: smallprint printgap noloewdin
keywords: NOSOSCF
formula: C19H34O3
InChI: InChI=1/C19H34O3/c1-15(2)22-18(20)14-17(4)11-8-10-16(3)12-9-13-19(5,6)21-7/h8,11,14-16H,9-10,12-13H2,1-7H3
56 atoms
O  -2.983818 3.490455 -0.927659
O  4.664538 -1.297558 0.700723
O  4.30752 -1.347537 -1.508303
C  -3.463807 0.821624 0.233178
C  -2.855797 2.042551 0.916398
C  -2.729971 -0.456391 0.623003
C  -3.368955 3.407618 0.446283
C  -3.232015 -1.716975 -0.081174
C  -2.235572 -2.87722 0.097961
C  -2.684258 4.498594 1.268037
C  -4.883844 3.510904 0.612086
C  -4.611773 -2.135539 0.410155
C  -0.957815 -2.631226 -0.626991
C  -3.355678 4.649313 -1.635982
C  0.225901 -2.435891 -0.03647
C  1.468697 -2.106074 -0.728911
C  1.424799 -2.018952 -2.22106
C  2.550223 -1.879046 0.048564
C  3.896969 -1.488365 -0.373534
C  6.035825 -0.877332 0.531358
C  6.098971 0.623436 0.321952
C  6.768865 -1.313252 1.781371
H  -3.416757 0.932931 -0.85387
H  -4.52341 0.740902 0.489346
H  -1.76821 2.024692 0.780486
H  -3.024013 1.970597 1.994843
H  -2.790918 -0.606025 1.70783
H  -1.667841 -0.317768 0.39878
H  -3.30143 -1.503025 -1.155096
H  -2.693741 -3.792082 -0.292257
H  -2.049748 -3.041473 1.163768
H  -2.907482 4.366791 2.327402
H  -3.019986 5.499902 0.994245
H  -1.599461 4.459606 1.150306
H  -5.251906 4.51789 0.40992
H  -5.416039 2.822478 -0.045767
H  -5.163131 3.270396 1.638675
H  -4.58578 -2.394833 1.471442
H  -4.976943 -3.008224 -0.134174
H  -5.348814 -1.341717 0.283071
H  -1.040913 -2.570566 -1.708458
H  -2.905644 5.562737 -1.234396
H  -4.43913 4.797389 -1.680597
H  -2.997213 4.527388 -2.658707
H  0.282476 -2.491522 1.04722
H  1.06585 -2.958773 -2.643659
H  0.71674 -1.247809 -2.529994
H  2.384811 -1.793091 -2.667132
H  2.423334 -1.971427 1.121252
H  6.461005 -1.391243 -0.333573
H  5.689616 1.157134 1.181287
H  7.138186 0.930723 0.202219
H  5.559152 0.939918 -0.570278
H  6.368646 -0.825395 2.671586
H  7.821226 -1.043155 1.698521
H  6.714223 -2.393088 1.922553
elementType: O C H
totalener: -970.27453689 hartree
nucrepener: 1784.07898552 hartree
electener: -2754.35352241 hartree
oneelecener: -4861.19720596 hartree
twoeener: 2106.84368354 hartree
cpcmener: -0.02800423 hartree
kineticenergy: 965.61330920 hartree
xcener: -96.763701936608 hartree
chargesum: -0.0000000
charge: -0.416473 -0.299632 -0.518086 -0.141053 -0.152960 -0.181929 0.342151 0.088121 -0.111680 -0.336267 -0.381060 -0.312733 -0.117004 -0.117898 -0.183601 0.025884 -0.265158 -0.185461 0.491398 0.158712 -0.263554 -0.254477 0.060928 0.073971 0.077314 0.077286 0.070697 0.081186 0.039479 0.094737 0.081092 0.097735 0.099467 0.100199 0.105831 0.103348 0.104222 0.083109 0.092911 0.090121 0.121954 0.089946 0.092201 0.117875 0.118234 0.107024 0.108047 0.106862 0.116548 0.063228 0.090345 0.097507 0.092925 0.088820 0.090758 0.096852
qa: -0.4165 -0.2996 -0.5181 -0.1411 -0.1530 -0.1819 0.3422 0.0881 -0.1117 -0.3363 -0.3811 -0.3127 -0.1170 -0.1179 -0.1836 0.0259 -0.2652 -0.1855 0.4914 0.1587 -0.2636 -0.2545 0.0609 0.0740 0.0773 0.0773 0.0707 0.0812 0.0395 0.0947 0.0811 0.0977 0.0995 0.1002 0.1058 0.1033 0.1042 0.0831 0.0929 0.0901 0.1220 0.0899 0.0922 0.1179 0.1182 0.1070 0.1080 0.1069 0.1165 0.0632 0.0903 0.0975 0.0929 0.0888 0.0908 0.0969
va: 1.9334 2.1241 1.9769 3.8697 3.7536 3.9069 3.8151 3.7639 3.9111 3.9258 3.9476 3.9426 3.8594 3.9225 3.9097 3.6918 3.9216 3.7819 4.1433 3.8130 3.9067 3.9335 1.0343 1.0056 1.0256 1.0151 1.0112 1.0068 1.0232 1.0057 1.0154 1.0051 1.0015 1.0085 0.9987 0.9978 1.0022 1.0016 1.0039 1.0039 1.0056 0.9831 0.9814 0.9915 1.0215 0.9964 0.9950 1.0355 1.0335 1.0235 1.0065 1.0057 1.0174 1.0067 1.0053 1.0082
dispcorr: -0.023468974 hartree
energy: -970.298005860785
dipole: -21.04404 19.67680 -1.36725 13.10574 -12.66719 0.43855 5.99975 -4.87095 1.12880
magnitude: 1.82644 au
magnitude: 4.64244 debye
