program: Orca
programVersion: 5.0.2
elementType: O O O C C C C C C C C C C C C C C C C C C C H H H H H H H H H H H H H H H H H H H H H H H H H H H H H H H H H H
charge: 0
multiplicity: 1
keywords: wb97x-d3
keywords: def2-TZVPP
keywords: def2/J RIJCOSX
keywords: DEFGRID2
keywords: scfconv7
keywords: smallprint printgap noloewdin
keywords: NOSOSCF
formula: C19H34O3
InChI: InChI=1/C19H34O3/c1-15(2)22-18(20)14-17(4)11-8-10-16(3)12-9-13-19(5,6)21-7/h8,11,14-16H,9-10,12-13H2,1-7H3
56 atoms
O  -4.05605 3.494881 -1.158242
O  5.183917 -1.754818 0.673462
O  4.674918 -1.036744 -1.383864
C  -3.744927 0.887924 0.195856
C  -3.296212 2.259604 0.689935
C  -2.729652 -0.191738 0.555879
C  -4.158244 3.454101 0.266672
C  -3.044565 -1.57597 -0.010606
C  -1.876373 -2.544748 0.220905
C  -3.575141 4.721899 0.889167
C  -5.605701 3.279873 0.72238
C  -4.324264 -2.160767 0.573873
C  -0.623962 -2.129927 -0.473515
C  -4.807505 4.475295 -1.834569
C  0.583486 -2.070394 0.098476
C  1.817792 -1.688867 -0.583073
C  1.711598 -1.245269 -2.007419
C  2.959377 -1.776512 0.13446
C  4.323154 -1.471871 -0.305628
C  6.596277 -1.53669 0.470076
C  6.943433 -0.088077 0.753352
C  7.309205 -2.493056 1.40113
H  -3.876984 0.89974 -0.889876
H  -4.720343 0.641284 0.622448
H  -2.270647 2.444353 0.349918
H  -3.251504 2.247716 1.783012
H  -2.637312 -0.265017 1.646428
H  -1.74683 0.127523 0.192541
H  -3.178041 -1.475862 -1.095276
H  -2.169254 -3.529331 -0.163049
H  -1.696301 -2.669414 1.29342
H  -2.538863 4.873346 0.581485
H  -3.590471 4.646948 1.976979
H  -4.142309 5.615145 0.623755
H  -6.098555 2.446008 0.220414
H  -5.63709 3.085211 1.794953
H  -6.202193 4.175822 0.5441
H  -5.193769 -1.536973 0.364671
H  -4.246487 -2.265527 1.659018
H  -4.529822 -3.150288 0.161179
H  -0.737387 -1.875574 -1.524233
H  -4.544614 5.49727 -1.543866
H  -5.88756 4.354087 -1.705361
H  -4.588494 4.368251 -2.897581
H  0.678562 -2.332469 1.148819
H  1.011452 -0.41204 -2.08993
H  2.6584 -0.935757 -2.431219
H  1.31158 -2.051581 -2.625023
H  2.882995 -2.123363 1.158873
H  6.850594 -1.78347 -0.563008
H  6.422166 0.598795 0.086681
H  6.701559 0.179546 1.783446
H  8.013403 0.065026 0.610978
H  7.052201 -3.530085 1.183275
H  7.070833 -2.288364 2.446045
H  8.386488 -2.386408 1.278091
elementType: O C H
totalener: -970.27510015 hartree
nucrepener: 1755.21617536 hartree
electener: -2725.49127551 hartree
oneelecener: -4803.39175461 hartree
twoeener: 2077.90047910 hartree
cpcmener: -0.02813537 hartree
kineticenergy: 965.60360698 hartree
xcener: -96.761953331883 hartree
chargesum: -0.0000000
charge: -0.417017 -0.300078 -0.518664 -0.138220 -0.153901 -0.174833 0.340700 0.096282 -0.119178 -0.335009 -0.379714 -0.324217 -0.146170 -0.118080 -0.150902 0.017430 -0.263710 -0.188763 0.492761 0.160672 -0.264397 -0.254356 0.062302 0.076051 0.077333 0.076887 0.069944 0.077368 0.039005 0.096304 0.081603 0.099125 0.097816 0.099878 0.102432 0.105067 0.105580 0.092184 0.085505 0.093084 0.128843 0.090189 0.092505 0.118102 0.115945 0.105411 0.107412 0.108079 0.116029 0.062060 0.093754 0.089934 0.097240 0.097029 0.088961 0.090402
qa: -0.4170 -0.3001 -0.5187 -0.1382 -0.1539 -0.1748 0.3407 0.0963 -0.1192 -0.3350 -0.3797 -0.3242 -0.1462 -0.1181 -0.1509 0.0174 -0.2637 -0.1888 0.4928 0.1607 -0.2644 -0.2544 0.0623 0.0761 0.0773 0.0769 0.0699 0.0774 0.0390 0.0963 0.0816 0.0991 0.0978 0.0999 0.1024 0.1051 0.1056 0.0922 0.0855 0.0931 0.1288 0.0902 0.0925 0.1181 0.1159 0.1054 0.1074 0.1081 0.1160 0.0621 0.0938 0.0899 0.0972 0.0970 0.0890 0.0904
va: 1.9316 2.1232 1.9762 3.8663 3.7589 3.8945 3.8178 3.7743 3.9089 3.9278 3.9466 3.9474 3.8877 3.9221 3.9016 3.7063 3.9192 3.7875 4.1413 3.8114 3.9084 3.9317 1.0328 1.0038 1.0263 1.0147 1.0111 1.0098 1.0225 1.0043 1.0148 1.0089 1.0049 1.0023 0.9978 1.0023 0.9985 1.0022 1.0009 1.0044 1.0033 0.9832 0.9816 0.9914 1.0225 0.9968 1.0359 0.9951 1.0337 1.0244 1.0163 1.0066 1.0058 1.0081 1.0069 1.0053
dispcorr: -0.023212801 hartree
energy: -970.298312949431
dipole: -23.01532 21.66050 -1.35482 10.92004 -10.86642 0.05362 5.86848 -4.74092 1.12757
magnitude: 1.76347 au
magnitude: 4.48238 debye
