program: Orca
programVersion: 5.0.2
elementType: O O O C C C C C C C C C C C C C C C C C C C H H H H H H H H H H H H H H H H H H H H H H H H H H H H H H H H H H
charge: 0
multiplicity: 1
keywords: wb97x-d3
keywords: def2-TZVPP
keywords: def2/J RIJCOSX
keywords: DEFGRID2
keywords: scfconv7
keywords: smallprint printgap noloewdin
keywords: NOSOSCF
formula: C19H34O3
InChI: InChI=1/C19H34O3/c1-15(2)22-18(20)14-17(4)11-8-10-16(3)12-9-13-19(5,6)21-7/h8,11,14-16H,9-10,12-13H2,1-7H3
56 atoms
O  -3.434001 3.119721 -1.506376
O  4.828093 -2.007044 0.512789
O  4.416218 0.121211 -0.044154
C  -3.825734 0.623899 0.079456
C  -3.994267 2.039564 0.620448
C  -3.174885 -0.295548 1.10415
C  -4.365094 3.104204 -0.421285
C  -2.977292 -1.741411 0.649178
C  -2.174467 -1.857062 -0.664248
C  -4.442864 4.471729 0.254544
C  -5.706978 2.783564 -1.068473
C  -2.324581 -2.55681 1.75823
C  -0.905674 -1.072658 -0.651298
C  -2.091407 3.415632 -1.20081
C  0.307164 -1.599795 -0.453109
C  1.551856 -0.837713 -0.384406
C  1.480107 0.629018 -0.667694
C  2.664321 -1.529728 -0.054123
C  4.025484 -1.01772 0.119415
C  6.230779 -1.748004 0.734454
C  6.708183 -2.809408 1.701931
C  6.979063 -1.789731 -0.583211
H  -3.219952 0.6503 -0.830215
H  -4.795422 0.210853 -0.214342
H  -3.072305 2.339219 1.130423
H  -4.766554 2.047071 1.395428
H  -3.779545 -0.301889 2.01716
H  -2.204502 0.123967 1.395312
H  -3.963584 -2.173578 0.44745
H  -2.794329 -1.509488 -1.49496
H  -1.962279 -2.912754 -0.851064
H  -3.522178 4.730305 0.780393
H  -5.245609 4.478211 0.992905
H  -4.653713 5.260313 -0.47049
H  -5.682139 1.840282 -1.616047
H  -6.485252 2.705966 -0.308926
H  -6.003707 3.568206 -1.767227
H  -2.9215 -2.52411 2.671415
H  -1.331154 -2.175282 2.004246
H  -2.214735 -3.60483 1.473808
H  -1.004452 -0.000191 -0.792136
H  -1.648807 2.726296 -0.473748
H  -1.952086 4.435274 -0.827517
H  -1.524712 3.3228 -2.127874
H  0.393817 -2.672954 -0.306437
H  0.834835 1.122747 0.061964
H  2.445482 1.118403 -0.648749
H  1.030175 0.800943 -1.646816
H  2.556734 -2.59341 0.124756
H  6.343135 -0.764075 1.19512
H  6.162141 -2.766996 2.644777
H  6.600738 -3.811236 1.28297
H  7.763373 -2.652184 1.923628
H  8.039533 -1.6088 -0.406253
H  6.628844 -1.029718 -1.281267
H  6.880963 -2.767126 -1.058464
elementType: O C H
totalener: -970.27409121 hartree
nucrepener: 1817.30450344 hartree
electener: -2787.57859465 hartree
oneelecener: -4926.94346250 hartree
twoeener: 2139.36486785 hartree
cpcmener: -0.02839065 hartree
kineticenergy: 965.61266475 hartree
xcener: -96.765949429716 hartree
chargesum: 0.0000000
charge: -0.430476 -0.298302 -0.518970 -0.170961 -0.247529 -0.173857 0.387045 0.099978 -0.133278 -0.338385 -0.320137 -0.334732 -0.118394 -0.120389 -0.179459 0.028487 -0.268070 -0.189435 0.489101 0.157511 -0.254616 -0.262700 0.065128 0.087141 0.090346 0.096692 0.084928 0.072149 0.044616 0.103283 0.091348 0.099385 0.099144 0.101732 0.097164 0.091258 0.100451 0.094618 0.085241 0.094784 0.116170 0.078167 0.101945 0.123186 0.119252 0.105965 0.109876 0.107137 0.115800 0.063436 0.097256 0.088922 0.090672 0.097488 0.093037 0.089851
qa: -0.4305 -0.2983 -0.5190 -0.1710 -0.2475 -0.1739 0.3870 0.1000 -0.1333 -0.3384 -0.3201 -0.3347 -0.1184 -0.1204 -0.1795 0.0285 -0.2681 -0.1894 0.4891 0.1575 -0.2546 -0.2627 0.0651 0.0871 0.0903 0.0967 0.0849 0.0721 0.0446 0.1033 0.0913 0.0994 0.0991 0.1017 0.0972 0.0913 0.1005 0.0946 0.0852 0.0948 0.1162 0.0782 0.1019 0.1232 0.1193 0.1060 0.1099 0.1071 0.1158 0.0634 0.0973 0.0889 0.0907 0.0975 0.0930 0.0899
va: 1.9130 2.1247 1.9763 3.8418 3.8231 3.8664 3.7836 3.7822 3.9082 3.9187 3.9104 3.9570 3.8414 3.9190 3.8994 3.6784 3.9219 3.7969 4.1421 3.8141 3.9321 3.9069 1.0243 1.0112 1.0009 1.0132 1.0115 1.0045 1.0160 1.0027 1.0124 0.9982 1.0052 1.0088 1.0055 1.0049 1.0098 1.0053 0.9981 1.0043 0.9919 0.9792 0.9850 0.9902 1.0200 0.9934 1.0364 0.9963 1.0342 1.0232 1.0082 1.0068 1.0052 1.0055 1.0171 1.0067
dispcorr: -0.025733781 hartree
energy: -970.299824992072
dipole: -17.93108 17.10577 -0.82531 4.88019 -5.53293 -0.65274 4.30153 -3.43508 0.86645
magnitude: 1.36306 au
magnitude: 3.46463 debye
