program: Orca
programVersion: 5.0.2
elementType: O O O C C C C C C C C C C C C C C C C C C C H H H H H H H H H H H H H H H H H H H H H H H H H H H H H H H H H H
charge: 0
multiplicity: 1
keywords: wb97x-d3
keywords: def2-TZVPP
keywords: def2/J RIJCOSX
keywords: DEFGRID2
keywords: scfconv7
keywords: smallprint printgap noloewdin
keywords: NOSOSCF
formula: C19H34O3
InChI: InChI=1/C19H34O3/c1-15(2)22-18(20)14-17(4)11-8-10-16(3)12-9-13-19(5,6)21-7/h8,11,14-16H,9-10,12-13H2,1-7H3
56 atoms
O  -3.757912 3.499807 -1.081211
O  4.976797 -1.564176 0.70063
O  4.510626 -1.195952 -1.455842
C  -3.603608 0.868839 0.225954
C  -3.028341 2.189566 0.726585
C  -2.679959 -0.299645 0.552001
C  -3.801725 3.456703 0.346439
C  -3.116665 -1.638106 -0.04283
C  -2.031232 -2.708399 0.15582
C  -3.0863 4.66565 0.947685
C  -5.237964 3.399978 0.864342
C  -4.437447 -2.124503 0.540063
C  -0.766839 -2.379947 -0.560526
C  -4.439103 4.555124 -1.717664
C  0.431183 -2.26196 0.021816
C  1.668935 -1.904333 -0.66599
C  1.585341 -1.619056 -2.131671
C  2.787968 -1.851287 0.089797
C  4.143521 -1.501095 -0.338893
C  6.372305 -1.241712 0.514263
C  6.57132 0.260562 0.570706
C  7.123234 -1.962428 1.612586
H  -3.753838 0.906664 -0.856727
H  -4.588995 0.701148 0.667843
H  -2.001002 2.294738 0.359033
H  -2.95414 2.156006 1.817606
H  -2.584942 -0.405838 1.639567
H  -1.677355 -0.056712 0.185427
H  -3.249923 -1.500785 -1.123399
H  -2.414081 -3.659912 -0.230229
H  -1.840657 -2.853434 1.223699
H  -2.059896 4.739833 0.583168
H  -3.046584 4.576643 2.033889
H  -3.59485 5.604403 0.723364
H  -5.238741 3.18798 1.934168
H  -5.762508 4.346776 0.726932
H  -5.821988 2.620681 0.372732
H  -5.250259 -1.421503 0.355462
H  -4.36024 -2.263464 1.621326
H  -4.731313 -3.081018 0.104049
H  -0.867777 -2.214098 -1.629741
H  -4.291859 4.429329 -2.790824
H  -4.054729 5.542846 -1.444278
H  -5.516957 4.546739 -1.528252
H  0.509876 -2.428994 1.092575
H  0.875347 -0.810834 -2.315577
H  2.534905 -1.341493 -2.570444
H  1.207412 -2.493387 -2.664454
H  2.692627 -2.085942 1.143849
H  6.699951 -1.623914 -0.454855
H  6.027708 0.779993 -0.218029
H  6.252052 0.662819 1.533519
H  7.62944 0.492301 0.446593
H  6.966215 -3.0404 1.564499
H  6.824081 -1.610989 2.601393
H  8.191713 -1.778949 1.503258
elementType: O C H
totalener: -970.27518839 hartree
nucrepener: 1767.01787125 hartree
electener: -2737.29305964 hartree
oneelecener: -4827.02563506 hartree
twoeener: 2089.73257543 hartree
cpcmener: -0.02812392 hartree
kineticenergy: 965.61499970 hartree
xcener: -96.764398339360 hartree
chargesum: -0.0000000
charge: -0.416299 -0.300469 -0.518961 -0.140422 -0.152364 -0.176168 0.338969 0.092993 -0.117678 -0.334916 -0.381021 -0.322930 -0.133676 -0.118002 -0.162882 0.020756 -0.265103 -0.186535 0.493017 0.160824 -0.263514 -0.255515 0.062178 0.075929 0.077451 0.076803 0.070403 0.077765 0.039933 0.095517 0.081028 0.099334 0.098039 0.099814 0.105243 0.105883 0.103018 0.092319 0.085343 0.092828 0.126719 0.117927 0.090375 0.092358 0.115915 0.106276 0.107608 0.108125 0.116198 0.062034 0.092970 0.089996 0.097336 0.097208 0.088909 0.091115
qa: -0.4163 -0.3005 -0.5190 -0.1404 -0.1524 -0.1762 0.3390 0.0930 -0.1177 -0.3349 -0.3810 -0.3229 -0.1337 -0.1180 -0.1629 0.0208 -0.2651 -0.1865 0.4930 0.1608 -0.2635 -0.2555 0.0622 0.0759 0.0775 0.0768 0.0704 0.0778 0.0399 0.0955 0.0810 0.0993 0.0980 0.0998 0.1052 0.1059 0.1030 0.0923 0.0853 0.0928 0.1267 0.1179 0.0904 0.0924 0.1159 0.1063 0.1076 0.1081 0.1162 0.0620 0.0930 0.0900 0.0973 0.0972 0.0889 0.0911
va: 1.9323 2.1238 1.9753 3.8693 3.7580 3.8940 3.8184 3.7676 3.9135 3.9265 3.9471 3.9475 3.8779 3.9222 3.9058 3.6995 3.9199 3.7856 4.1419 3.8120 3.9068 3.9325 1.0330 1.0036 1.0256 1.0150 1.0115 1.0094 1.0231 1.0055 1.0153 1.0090 1.0049 1.0019 1.0022 0.9984 0.9980 1.0020 1.0008 1.0044 1.0042 0.9915 0.9831 0.9815 1.0227 0.9959 1.0358 0.9955 1.0334 1.0241 1.0170 1.0067 1.0057 1.0081 1.0066 1.0053
dispcorr: -0.023347033 hartree
energy: -970.298535421371
dipole: -21.89613 20.59492 -1.30121 12.16260 -11.91535 0.24725 6.22851 -5.04647 1.18204
magnitude: 1.77525 au
magnitude: 4.51231 debye
