program: Orca
programVersion: 5.0.2
elementType: O O O C C C C C C C C C C C C C C C C C C C H H H H H H H H H H H H H H H H H H H H H H H H H H H H H H H H H H
charge: 0
multiplicity: 1
keywords: wb97x-d3
keywords: def2-TZVPP
keywords: def2/J RIJCOSX
keywords: DEFGRID2
keywords: scfconv7
keywords: smallprint printgap noloewdin
keywords: NOSOSCF
formula: C19H34O3
InChI: InChI=1/C19H34O3/c1-15(2)22-18(20)14-17(4)11-8-10-16(3)12-9-13-19(5,6)21-7/h8,11,14-16H,9-10,12-13H2,1-7H3
56 atoms
O  -5.378891 4.132159 0.339248
O  5.935637 -1.760851 -0.39961
O  5.020764 -3.173116 1.074989
C  -4.003764 1.548042 0.090139
C  -5.264463 2.000344 -0.638937
C  -3.095651 0.715686 -0.807278
C  -6.173868 2.96272 0.132899
C  -1.868191 0.137047 -0.101992
C  -1.082337 -0.760621 -1.072708
C  -6.623764 2.347624 1.456933
C  -7.396483 3.283975 -0.725517
C  -0.969532 1.225849 0.4732
C  0.002892 -1.522203 -0.393207
C  -5.939526 5.17305 1.103215
C  1.307824 -1.38225 -0.65029
C  2.38206 -2.091239 0.040386
C  1.98951 -3.072547 1.098959
C  3.645321 -1.787803 -0.331715
C  4.893849 -2.333034 0.206364
C  7.274869 -2.160534 -0.03586
C  7.658077 -3.427726 -0.775097
C  8.174375 -0.995086 -0.385381
H  -4.270997 0.956082 0.971153
H  -3.45801 2.418554 0.459627
H  -5.856461 1.122476 -0.913761
H  -4.982039 2.480331 -1.58323
H  -2.766976 1.324604 -1.657567
H  -3.676333 -0.109824 -1.232915
H  -2.220377 -0.493098 0.724278
H  -0.672412 -0.152252 -1.88465
H  -1.779085 -1.473361 -1.527449
H  -5.793845 2.218092 2.152829
H  -7.06316 1.365207 1.279261
H  -7.384172 2.952233 1.953462
H  -7.948053 2.370955 -0.95231
H  -8.09083 3.959011 -0.222983
H  -7.106563 3.740179 -1.673838
H  -0.088906 0.806383 0.961823
H  -1.486733 1.832231 1.216793
H  -0.619133 1.89659 -0.315792
H  -0.324706 -2.213863 0.37797
H  -6.164449 4.878292 2.132508
H  -6.851343 5.58848 0.66327
H  -5.199738 5.972891 1.144325
H  1.614592 -0.678924 -1.419503
H  1.328378 -3.833299 0.680664
H  2.833817 -3.572728 1.555655
H  1.42558 -2.56926 1.886451
H  3.774313 -1.05056 -1.116018
H  7.314453 -2.333246 1.041724
H  8.676232 -3.711898 -0.50813
H  7.008617 -4.265773 -0.523764
H  7.625694 -3.277153 -1.855347
H  8.163413 -0.784787 -1.455901
H  9.199848 -1.230991 -0.102985
H  7.884446 -0.090233 0.149555
elementType: O C H
totalener: -970.27525636 hartree
nucrepener: 1714.51159091 hartree
electener: -2684.78684727 hartree
oneelecener: -4721.86161222 hartree
twoeener: 2037.07476495 hartree
cpcmener: -0.02800296 hartree
kineticenergy: 965.61102216 hartree
xcener: -96.763717773649 hartree
chargesum: -0.0000000
charge: -0.414630 -0.299929 -0.519141 -0.118737 -0.164071 -0.187733 0.335852 0.113193 -0.106036 -0.379797 -0.335037 -0.345031 -0.148503 -0.117309 -0.158973 0.018794 -0.264947 -0.187031 0.493725 0.159379 -0.263713 -0.255093 0.069216 0.063884 0.077427 0.077502 0.071106 0.073631 0.044569 0.080068 0.093558 0.104185 0.105338 0.105186 0.097509 0.099617 0.099257 0.097936 0.098181 0.086180 0.125798 0.092906 0.090158 0.117502 0.115497 0.106909 0.107170 0.107441 0.116472 0.062983 0.097118 0.093143 0.090112 0.089135 0.090714 0.097361
qa: -0.4146 -0.2999 -0.5191 -0.1187 -0.1641 -0.1877 0.3359 0.1132 -0.1060 -0.3798 -0.3350 -0.3450 -0.1485 -0.1173 -0.1590 0.0188 -0.2649 -0.1870 0.4937 0.1594 -0.2637 -0.2551 0.0692 0.0639 0.0774 0.0775 0.0711 0.0736 0.0446 0.0801 0.0936 0.1042 0.1053 0.1052 0.0975 0.0996 0.0993 0.0979 0.0982 0.0862 0.1258 0.0929 0.0902 0.1175 0.1155 0.1069 0.1072 0.1074 0.1165 0.0630 0.0971 0.0931 0.0901 0.0891 0.0907 0.0974
va: 1.9352 2.1242 1.9753 3.8395 3.7797 3.9100 3.8245 3.7393 3.9232 3.9430 3.9248 3.9539 3.8822 3.9210 3.9233 3.6998 3.9225 3.7860 4.1408 3.8114 3.9072 3.9324 1.0074 1.0400 1.0158 1.0239 1.0108 1.0120 1.0227 1.0164 1.0066 0.9971 1.0024 0.9983 1.0050 1.0025 1.0093 1.0020 1.0021 1.0021 1.0042 0.9816 0.9835 0.9918 1.0232 0.9962 1.0357 0.9954 1.0333 1.0238 1.0059 1.0171 1.0067 1.0066 1.0053 1.0081
dispcorr: -0.023141611 hartree
energy: -970.298397967334
dipole: -25.30296 23.81413 -1.48883 13.19642 -12.66863 0.52779 0.30912 -0.61682 -0.30770
magnitude: 1.60930 au
magnitude: 4.09053 debye
