program: Orca
programVersion: 5.0.2
elementType: O O O C C C C C C C C C C C C C C C C C C C H H H H H H H H H H H H H H H H H H H H H H H H H H H H H H H H H H
charge: 0
multiplicity: 1
keywords: wb97x-d3
keywords: def2-TZVPP
keywords: def2/J RIJCOSX
keywords: DEFGRID2
keywords: scfconv7
keywords: smallprint printgap noloewdin
keywords: NOSOSCF
formula: C19H34O3
InChI: InChI=1/C19H34O3/c1-15(2)22-18(20)14-17(4)11-8-10-16(3)12-9-13-19(5,6)21-7/h8,11,14-16H,9-10,12-13H2,1-7H3
56 atoms
O  -6.812063 1.723533 1.05852
O  6.073369 -1.480896 -0.155083
O  4.978034 -3.309666 0.526297
C  -3.94479 1.774887 0.219569
C  -5.068077 2.55496 -0.452116
C  -2.843593 1.397441 -0.764752
C  -6.269777 2.894084 0.442336
C  -1.727579 0.543378 -0.162673
C  -0.780403 0.05752 -1.271386
C  -7.325681 3.622244 -0.38806
C  -5.851092 3.780011 1.610057
C  -0.953488 1.287739 0.918421
C  0.197707 -0.955045 -0.786218
C  -7.332794 0.733659 0.202216
C  1.525381 -0.79637 -0.799608
C  2.495121 -1.771058 -0.306843
C  1.962965 -3.051068 0.252579
C  3.797913 -1.422288 -0.387941
C  4.96429 -2.193141 0.04735
C  7.35495 -2.028552 0.223895
C  7.869723 -2.960932 -0.855146
C  8.269561 -0.84293 0.444383
H  -4.338661 0.86001 0.673425
H  -3.525558 2.366473 1.036618
H  -5.413283 2.0033 -1.333129
H  -4.671251 3.498559 -0.839121
H  -2.408827 2.304654 -1.200769
H  -3.293579 0.846078 -1.597444
H  -2.190711 -0.342063 0.290528
H  -0.258282 0.912179 -1.711949
H  -1.383202 -0.394434 -2.066803
H  -6.935679 4.583207 -0.725894
H  -8.225365 3.818191 0.199007
H  -7.615375 3.062336 -1.279024
H  -5.360694 4.683112 1.246436
H  -6.719088 4.086326 2.197085
H  -5.15733 3.271847 2.280894
H  -1.599272 1.60877 1.735936
H  -0.472194 2.178593 0.506209
H  -0.171699 0.664406 1.354791
H  -0.234931 -1.866647 -0.383883
H  -6.597128 0.348276 -0.51071
H  -8.205873 1.073963 -0.363558
H  -7.650152 -0.098667 0.83083
H  1.935396 0.12725 -1.198608
H  2.737523 -3.729401 0.58502
H  1.305822 -2.844631 1.099044
H  1.356376 -3.565313 -0.494524
H  4.030441 -0.452793 -0.812857
H  7.242312 -2.575079 1.163132
H  8.844344 -3.351741 -0.561924
H  7.209413 -3.812638 -1.014129
H  7.991641 -2.434865 -1.803148
H  7.890645 -0.185256 1.227081
H  8.39695 -0.259297 -0.46877
H  9.25282 -1.195031 0.755596
elementType: O C H
totalener: -970.27590653 hartree
nucrepener: 1719.35214655 hartree
electener: -2689.62805309 hartree
oneelecener: -4731.19775817 hartree
twoeener: 2041.56970508 hartree
cpcmener: -0.02876267 hartree
kineticenergy: 965.61948052 hartree
xcener: -96.765222895600 hartree
chargesum: 0.0000000
charge: -0.435091 -0.299699 -0.518928 -0.146048 -0.250088 -0.182909 0.394971 0.109472 -0.105066 -0.336836 -0.328140 -0.341907 -0.152268 -0.122772 -0.150160 0.013755 -0.263684 -0.183351 0.491719 0.159403 -0.263274 -0.254549 0.067885 0.082815 0.088419 0.091962 0.071999 0.073305 0.042379 0.079414 0.093615 0.098820 0.102519 0.099892 0.092902 0.100998 0.095724 0.097728 0.085100 0.097357 0.125422 0.088278 0.094870 0.123156 0.115067 0.106829 0.106901 0.106551 0.116152 0.063027 0.097366 0.092798 0.089844 0.097274 0.088715 0.090366
qa: -0.4351 -0.2997 -0.5189 -0.1460 -0.2501 -0.1829 0.3950 0.1095 -0.1051 -0.3368 -0.3281 -0.3419 -0.1523 -0.1228 -0.1502 0.0138 -0.2637 -0.1834 0.4917 0.1594 -0.2633 -0.2545 0.0679 0.0828 0.0884 0.0920 0.0720 0.0733 0.0424 0.0794 0.0936 0.0988 0.1025 0.0999 0.0929 0.1010 0.0957 0.0977 0.0851 0.0974 0.1254 0.0883 0.0949 0.1232 0.1151 0.1068 0.1069 0.1066 0.1162 0.0630 0.0974 0.0928 0.0898 0.0973 0.0887 0.0904
va: 1.9027 2.1233 1.9759 3.8633 3.8354 3.9072 3.7611 3.7467 3.9210 3.9196 3.9116 3.9523 3.8852 3.9219 3.9188 3.7041 3.9223 3.7841 4.1411 3.8127 3.9042 3.9335 1.0169 1.0049 1.0014 1.0114 1.0095 1.0136 1.0224 1.0166 1.0067 1.0055 1.0080 0.9979 1.0043 1.0089 1.0061 1.0030 1.0026 1.0022 1.0044 0.9813 0.9849 0.9896 1.0233 1.0359 0.9956 0.9960 1.0336 1.0230 1.0059 1.0181 1.0066 1.0081 1.0069 1.0053
dispcorr: -0.023457215 hartree
energy: -970.299363745867
dipole: -22.61595 22.00762 -0.60832 14.43516 -13.34341 1.09175 -1.07922 -0.04151 -1.12074
magnitude: 1.67870 au
magnitude: 4.26691 debye
