program: Orca
programVersion: 5.0.2
elementType: O O O C C C C C C C C C C C C C C C C C C C H H H H H H H H H H H H H H H H H H H H H H H H H H H H H H H H H H
charge: 0
multiplicity: 1
keywords: wb97x-d3
keywords: def2-TZVPP
keywords: def2/J RIJCOSX
keywords: DEFGRID2
keywords: scfconv7
keywords: smallprint printgap noloewdin
keywords: NOSOSCF
formula: C19H34O3
InChI: InChI=1/C19H34O3/c1-15(2)22-18(20)14-17(4)11-8-10-16(3)12-9-13-19(5,6)21-7/h8,11,14-16H,9-10,12-13H2,1-7H3
56 atoms
O  -5.455455 4.085697 0.406542
O  5.971815 -1.771313 -0.402626
O  5.036154 -3.159729 1.081487
C  -4.021423 1.543625 0.075884
C  -5.269525 2.005159 -0.668612
C  -3.07241 0.765862 -0.828529
C  -6.220352 2.913012 0.119674
C  -1.851271 0.188339 -0.111609
C  -1.036552 -0.684068 -1.080659
C  -6.699147 2.226369 1.397855
C  -7.422583 3.253131 -0.76037
C  -0.976122 1.276953 0.499433
C  0.042375 -1.446138 -0.391926
C  -6.062382 5.078895 1.198222
C  1.349616 -1.313176 -0.640739
C  2.414519 -2.03328 0.053046
C  2.008897 -3.003618 1.116781
C  3.681758 -1.751724 -0.32283
C  4.921842 -2.319627 0.211149
C  7.304165 -2.204263 -0.051077
C  7.648672 -3.480137 -0.794344
C  8.229407 -1.061543 -0.408405
H  -4.302695 0.909046 0.922179
H  -3.502978 2.406651 0.498432
H  -5.836275 1.130021 -0.99973
H  -4.970233 2.533242 -1.581465
H  -2.735214 1.4129 -1.646863
H  -3.62374 -0.05538 -1.299231
H  -2.211483 -0.460142 0.696905
H  -0.617374 -0.059887 -1.875699
H  -1.716551 -1.397486 -1.559336
H  -7.486719 2.792077 1.897904
H  -5.88954 2.078142 2.113637
H  -7.113444 1.2458 1.15994
H  -7.947607 2.341917 -1.049299
H  -8.146476 3.888274 -0.247624
H  -7.113245 3.761538 -1.675518
H  -1.515076 1.867489 1.24043
H  -0.614987 1.962682 -0.27166
H  -0.102203 0.858363 1.000911
H  -0.293438 -2.137154 0.37633
H  -6.306394 4.73427 2.207626
H  -6.972818 5.490622 0.751757
H  -5.344697 5.894182 1.293026
H  1.665629 -0.611956 -1.408119
H  1.3414 -3.760612 0.701702
H  2.846678 -3.50923 1.579337
H  1.447703 -2.489048 1.898866
H  3.82118 -1.01992 -1.110415
H  7.349393 -2.378645 1.025997
H  6.979607 -4.30135 -0.538796
H  7.612005 -3.327602 -1.874183
H  8.661091 -3.791006 -0.53537
H  9.251319 -1.323791 -0.136329
H  7.967857 -0.150332 0.130325
H  8.213349 -0.849698 -1.478549
elementType: O C H
totalener: -970.27528474 hartree
nucrepener: 1713.32910386 hartree
electener: -2683.60438860 hartree
oneelecener: -4719.49330615 hartree
twoeener: 2035.88891755 hartree
cpcmener: -0.02799120 hartree
kineticenergy: 965.60879201 hartree
xcener: -96.763229580558 hartree
chargesum: -0.0000000
charge: -0.414754 -0.300231 -0.519042 -0.116954 -0.166366 -0.184212 0.338565 0.110065 -0.104422 -0.379619 -0.335962 -0.343009 -0.151878 -0.117477 -0.155094 0.018264 -0.264916 -0.187717 0.493751 0.159523 -0.263755 -0.254651 0.068474 0.062646 0.077728 0.077765 0.070467 0.072672 0.043761 0.080052 0.093925 0.104945 0.103947 0.105305 0.097778 0.099383 0.099498 0.097725 0.085813 0.097554 0.125851 0.092868 0.090065 0.117706 0.115531 0.106721 0.107407 0.107398 0.116592 0.062841 0.093053 0.090142 0.097170 0.090664 0.097329 0.089114
qa: -0.4148 -0.3002 -0.5190 -0.1170 -0.1664 -0.1842 0.3386 0.1101 -0.1044 -0.3796 -0.3360 -0.3430 -0.1519 -0.1175 -0.1551 0.0183 -0.2649 -0.1877 0.4938 0.1595 -0.2638 -0.2547 0.0685 0.0626 0.0777 0.0778 0.0705 0.0727 0.0438 0.0801 0.0939 0.1049 0.1039 0.1053 0.0978 0.0994 0.0995 0.0977 0.0858 0.0976 0.1259 0.0929 0.0901 0.1177 0.1155 0.1067 0.1074 0.1074 0.1166 0.0628 0.0931 0.0901 0.0972 0.0907 0.0973 0.0891
va: 1.9354 2.1242 1.9754 3.8385 3.7810 3.9109 3.8208 3.7434 3.9196 3.9428 3.9246 3.9528 3.8850 3.9212 3.9220 3.7009 3.9221 3.7858 4.1412 3.8115 3.9077 3.9323 1.0076 1.0409 1.0158 1.0235 1.0112 1.0120 1.0228 1.0165 1.0065 0.9983 0.9973 1.0024 1.0050 1.0026 1.0092 1.0024 1.0023 1.0021 1.0043 0.9816 0.9835 0.9918 1.0232 0.9961 1.0357 0.9955 1.0333 1.0239 1.0170 1.0067 1.0059 1.0053 1.0081 1.0066
dispcorr: -0.023115820 hartree
energy: -970.298400557901
dipole: -25.54369 24.05481 -1.48888 12.85496 -12.36384 0.49112 0.11631 -0.47367 -0.35736
magnitude: 1.60800 au
magnitude: 4.08722 debye
