program: Orca
programVersion: 5.0.2
elementType: O O O C C C C C C C C C C C C C C C C C C C H H H H H H H H H H H H H H H H H H H H H H H H H H H H H H H H H H
charge: 0
multiplicity: 1
keywords: wb97x-d3
keywords: def2-TZVPP
keywords: def2/J RIJCOSX
keywords: DEFGRID2
keywords: scfconv7
keywords: smallprint printgap noloewdin
keywords: NOSOSCF
formula: C19H34O3
InChI: InChI=1/C19H34O3/c1-15(2)22-18(20)14-17(4)11-8-10-16(3)12-9-13-19(5,6)21-7/h8,11,14-16H,9-10,12-13H2,1-7H3
56 atoms
O  -0.788541 1.941633 -0.117271
O  3.950032 -0.471177 0.698231
O  3.23285 0.150792 -1.325524
C  -3.273345 0.358582 -0.027159
C  -2.938949 1.622504 0.759096
C  -3.838503 -0.738859 0.8703
C  -2.033682 2.628069 0.04122
C  -4.018757 -2.100052 0.186908
C  -2.730383 -2.943071 0.221501
C  -1.865955 3.863021 0.924103
C  -2.623945 3.033359 -1.307713
C  -5.147413 -2.888417 0.84159
C  -1.573476 -2.32477 -0.482867
C  0.254085 2.631035 -0.766029
C  -0.401644 -2.024013 0.089382
C  0.711514 -1.363752 -0.58643
C  0.529457 -1.013001 -2.029153
C  1.814042 -1.108635 0.153795
C  3.03445 -0.419132 -0.270261
C  5.219721 0.190749 0.505981
C  5.751293 0.498458 1.888798
C  6.158542 -0.697336 -0.286908
H  -2.38141 -0.004735 -0.538083
H  -3.99991 0.582808 -0.812509
H  -2.445384 1.343494 1.697025
H  -3.863403 2.130973 1.046253
H  -4.802862 -0.400482 1.263875
H  -3.190214 -0.866335 1.745366
H  -4.286551 -1.932617 -0.863418
H  -2.94603 -3.906012 -0.255397
H  -2.468962 -3.156687 1.262529
H  -1.427658 3.603207 1.889737
H  -2.836989 4.321609 1.113999
H  -1.237947 4.625506 0.460872
H  -2.056665 3.835947 -1.781353
H  -2.66258 2.194943 -2.00485
H  -3.642625 3.399431 -1.173505
H  -6.095351 -2.353423 0.767376
H  -4.945465 -3.055135 1.902471
H  -5.281522 -3.865598 0.373911
H  -1.732297 -2.106862 -1.535212
H  1.103835 1.94948 -0.823349
H  0.581577 3.522078 -0.220125
H  0.002414 2.93261 -1.78772
H  -0.260442 -2.248886 1.142918
H  0.206996 -1.888413 -2.593991
H  -0.257982 -0.263279 -2.135015
H  1.427361 -0.625398 -2.493113
H  1.816017 -1.440354 1.186105
H  5.052822 1.127187 -0.030954
H  5.921568 -0.412136 2.465496
H  6.703377 1.021319 1.803138
H  5.069661 1.141273 2.446523
H  5.775967 -0.919118 -1.282729
H  6.339384 -1.639784 0.232583
H  7.117831 -0.193946 -0.409162
elementType: O C H
totalener: -970.27348108 hartree
nucrepener: 1914.71190112 hartree
electener: -2884.98538220 hartree
oneelecener: -5123.13255483 hartree
twoeener: 2238.14717263 hartree
cpcmener: -0.02795291 hartree
kineticenergy: 965.60602671 hartree
xcener: -96.764226634773 hartree
chargesum: -0.0000000
charge: -0.406888 -0.301040 -0.525820 -0.108086 -0.178534 -0.178311 0.336613 0.079833 -0.126387 -0.338253 -0.377670 -0.308219 -0.097021 -0.117330 -0.180974 -0.003813 -0.276998 -0.170807 0.496411 0.159250 -0.254483 -0.263652 0.036937 0.077028 0.077489 0.085051 0.080416 0.070095 0.044428 0.093267 0.079993 0.100684 0.098227 0.099652 0.104432 0.103608 0.105776 0.089086 0.087594 0.089206 0.132440 0.090889 0.105594 0.100002 0.116612 0.117998 0.106361 0.113501 0.116203 0.062955 0.088766 0.090598 0.097432 0.092455 0.089836 0.097565
qa: -0.4069 -0.3010 -0.5258 -0.1081 -0.1785 -0.1783 0.3366 0.0798 -0.1264 -0.3383 -0.3777 -0.3082 -0.0970 -0.1173 -0.1810 -0.0038 -0.2770 -0.1708 0.4964 0.1592 -0.2545 -0.2637 0.0369 0.0770 0.0775 0.0851 0.0804 0.0701 0.0444 0.0933 0.0800 0.1007 0.0982 0.0997 0.1044 0.1036 0.1058 0.0891 0.0876 0.0892 0.1324 0.0909 0.1056 0.1000 0.1166 0.1180 0.1064 0.1135 0.1162 0.0630 0.0888 0.0906 0.0974 0.0925 0.0898 0.0976
va: 1.9309 2.1322 1.9516 3.8347 3.7864 3.9080 3.8282 3.7553 3.9337 3.9218 3.9536 3.9379 3.8607 3.9138 3.9026 3.6940 3.9043 3.7766 4.1099 3.8135 3.9342 3.9048 1.0475 1.0136 1.0261 1.0144 1.0055 1.0097 1.0223 1.0057 1.0135 1.0081 1.0054 1.0025 1.0009 0.9968 1.0024 1.0041 0.9997 1.0047 0.9984 1.0037 0.9911 0.9824 1.0220 0.9991 0.9960 1.0332 1.0329 1.0237 1.0067 1.0054 1.0078 1.0178 1.0068 1.0059
dispcorr: -0.027808414 hartree
energy: -970.301289489484
dipole: -14.91806 13.88720 -1.03086 6.19410 -6.06087 0.13322 2.03598 -1.66217 0.37381
magnitude: 1.10461 au
magnitude: 2.80769 debye
