program: Orca
programVersion: 5.0.2
elementType: O O O C C C C C C C C C C C C C C C C C C C H H H H H H H H H H H H H H H H H H H H H H H H H H H H H H H H H H
charge: 0
multiplicity: 1
keywords: wb97x-d3
keywords: def2-TZVPP
keywords: def2/J RIJCOSX
keywords: DEFGRID2
keywords: scfconv7
keywords: smallprint printgap noloewdin
keywords: NOSOSCF
formula: C19H34O3
InChI: InChI=1/C19H34O3/c1-15(2)22-18(20)14-17(4)11-8-10-16(3)12-9-13-19(5,6)21-7/h8,11,14-16H,9-10,12-13H2,1-7H3
56 atoms
O  -3.052853 3.502065 -1.124677
O  4.509901 -0.890487 0.743172
O  4.169837 -1.146863 -1.453287
C  -3.537529 0.833215 0.150957
C  -3.047521 2.081252 0.877796
C  -2.8540 -0.426125 0.66994
C  -3.447968 3.422723 0.247508
C  -3.312568 -1.714172 -0.015197
C  -2.302982 -2.853954 0.216324
C  -2.834718 4.563904 1.058099
C  -4.963047 3.582159 0.219752
C  -4.69759 -2.140773 0.454603
C  -1.024719 -2.616054 -0.510538
C  -1.682161 3.342453 -1.407119
C  0.143797 -2.333742 0.075461
C  1.382615 -2.012704 -0.628899
C  1.3619 -2.078544 -2.122576
C  2.436962 -1.653436 0.136243
C  3.763889 -1.223513 -0.310742
C  5.855267 -0.405249 0.538189
C  6.196596 0.422306 1.758063
C  6.808896 -1.567911 0.346833
H  -3.337352 0.91663 -0.921449
H  -4.622576 0.745518 0.252283
H  -1.956745 2.037888 0.970487
H  -3.423336 2.073211 1.905321
H  -3.011495 -0.522195 1.750865
H  -1.775087 -0.303085 0.533667
H  -3.359934 -1.528782 -1.09567
H  -2.745482 -3.788784 -0.142566
H  -2.123631 -2.974157 1.28889
H  -1.752384 4.468806 1.160052
H  -3.25139 4.574043 2.066001
H  -3.049404 5.531943 0.6011
H  -5.442599 2.821752 -0.398267
H  -5.372605 3.499186 1.226686
H  -5.246381 4.560318 -0.173636
H  -5.437509 -1.353222 0.305771
H  -4.688311 -2.38766 1.518942
H  -5.046335 -3.022122 -0.086335
H  -1.095124 -2.641058 -1.594215
H  -1.295806 2.357986 -1.124181
H  -1.053907 4.102052 -0.93157
H  -1.564082 3.444159 -2.486404
H  0.189091 -2.305409 1.160624
H  2.325656 -1.884531 -2.574925
H  1.022473 -3.062147 -2.450368
H  0.648768 -1.353866 -2.520087
H  2.298074 -1.649728 1.211234
H  5.868897 0.235657 -0.346139
H  5.500513 1.251343 1.88796
H  6.192949 -0.181105 2.667128
H  7.194474 0.844183 1.641493
H  6.568739 -2.159166 -0.536217
H  6.804313 -2.226767 1.216582
H  7.82302 -1.187793 0.221081
elementType: O C H
totalener: -970.27493034 hartree
nucrepener: 1803.86110147 hartree
electener: -2774.13603180 hartree
oneelecener: -4900.19021425 hartree
twoeener: 2126.05418245 hartree
cpcmener: -0.02832593 hartree
kineticenergy: 965.61476542 hartree
xcener: -96.764039570350 hartree
chargesum: 0.0000000
charge: -0.433175 -0.299957 -0.519346 -0.162230 -0.243076 -0.179736 0.379483 0.079575 -0.110461 -0.334151 -0.321383 -0.308079 -0.112781 -0.117042 -0.186900 0.026254 -0.264743 -0.188709 0.493732 0.159582 -0.255588 -0.263298 0.067153 0.084012 0.089391 0.094437 0.073616 0.082703 0.041105 0.094142 0.081168 0.098830 0.097974 0.101471 0.096118 0.090942 0.101189 0.089274 0.082437 0.092946 0.121349 0.084489 0.095534 0.121984 0.120330 0.107430 0.105947 0.108464 0.116989 0.063203 0.097416 0.088978 0.090990 0.092597 0.090059 0.097360
qa: -0.4332 -0.3000 -0.5193 -0.1622 -0.2431 -0.1797 0.3795 0.0796 -0.1105 -0.3342 -0.3214 -0.3081 -0.1128 -0.1170 -0.1869 0.0263 -0.2647 -0.1887 0.4937 0.1596 -0.2556 -0.2633 0.0672 0.0840 0.0894 0.0944 0.0736 0.0827 0.0411 0.0941 0.0812 0.0988 0.0980 0.1015 0.0961 0.0909 0.1012 0.0893 0.0824 0.0929 0.1213 0.0845 0.0955 0.1220 0.1203 0.1074 0.1059 0.1085 0.1170 0.0632 0.0974 0.0890 0.0910 0.0926 0.0901 0.0974
va: 1.9089 2.1249 1.9748 3.8618 3.8157 3.9083 3.7805 3.7694 3.9096 3.9214 3.9067 3.9406 3.8551 3.9193 3.9077 3.6870 3.9222 3.7897 4.1384 3.8129 3.9327 3.9041 1.0195 1.0081 0.9994 1.0117 1.0119 1.0039 1.0223 1.0059 1.0149 1.0000 1.0051 1.0095 1.0058 1.0048 1.0095 1.0049 1.0020 1.0038 1.0056 0.9821 0.9856 0.9901 1.0202 1.0348 0.9968 0.9949 1.0333 1.0232 1.0081 1.0065 1.0052 1.0182 1.0068 1.0055
dispcorr: -0.024057176 hartree
energy: -970.298987514067
dipole: -17.26678 16.79609 -0.47068 8.49817 -8.73531 -0.23715 6.00182 -4.66186 1.33995
magnitude: 1.43988 au
magnitude: 3.65989 debye
