program: Orca
programVersion: 5.0.2
elementType: O O O C C C C C C C C C C C C C C C C C C C H H H H H H H H H H H H H H H H H H H H H H H H H H H H H H H H H H
charge: 0
multiplicity: 1
keywords: wb97x-d3
keywords: def2-TZVPP
keywords: def2/J RIJCOSX
keywords: DEFGRID2
keywords: scfconv7
keywords: smallprint printgap noloewdin
keywords: NOSOSCF
formula: C19H34O3
InChI: InChI=1/C19H34O3/c1-15(2)22-18(20)14-17(4)11-8-10-16(3)12-9-13-19(5,6)21-7/h8,11,14-16H,9-10,12-13H2,1-7H3
56 atoms
O  -5.350348 3.192402 0.773654
O  5.284037 -1.403352 0.582819
O  4.721673 -1.139859 -1.566542
C  -3.603522 0.95051 -0.010754
C  -3.185102 2.3638 0.37895
C  -2.584104 -0.083844 0.452263
C  -4.169174 3.483689 0.023237
C  -2.922153 -1.523922 0.066698
C  -1.761422 -2.470233 0.406955
C  -4.446808 3.509839 -1.478703
C  -3.570087 4.820536 0.458625
C  -4.199459 -2.013448 0.738658
C  -0.52504 -2.176974 -0.370633
C  -6.46647 4.02658 0.567781
C  0.687248 -1.985352 0.160979
C  1.902662 -1.710231 -0.601772
C  1.763559 -1.553181 -2.082141
C  3.054388 -1.620831 0.100002
C  4.401102 -1.363483 -0.416147
C  6.685687 -1.188275 0.306842
C  7.300852 -0.702188 1.601376
C  7.323943 -2.471557 -0.188096
H  -3.71078 0.874858 -1.097058
H  -4.584628 0.724339 0.412283
H  -2.22696 2.597355 -0.094615
H  -3.003294 2.39822 1.459168
H  -2.470587 -0.027325 1.541664
H  -1.607181 0.180704 0.033634
H  -3.070624 -1.561159 -1.019908
H  -2.077445 -3.494231 0.176157
H  -1.555271 -2.44012 1.48127
H  -5.029169 4.38412 -1.774212
H  -4.984547 2.621459 -1.813114
H  -3.50516 3.552879 -2.027822
H  -3.36151 4.829604 1.530346
H  -2.629626 4.999981 -0.06394
H  -4.225234 5.663559 0.233053
H  -5.067088 -1.417452 0.455158
H  -4.110603 -1.970287 1.826992
H  -4.415459 -3.048014 0.466147
H  -0.654753 -2.13066 -1.448492
H  -6.85039 3.984957 -0.455949
H  -6.272155 5.075225 0.813499
H  -7.256139 3.673244 1.231361
H  0.800015 -2.041056 1.240121
H  1.371031 -2.471213 -2.522808
H  1.043012 -0.765718 -2.308431
H  2.694772 -1.312213 -2.577616
H  2.999228 -1.762311 1.173193
H  6.783023 -0.408567 -0.451827
H  7.216746 -1.449728 2.39182
H  8.360223 -0.499359 1.446055
H  6.83375 0.221137 1.944771
H  8.383713 -2.300182 -0.378027
H  6.876991 -2.823629 -1.117293
H  7.242093 -3.263868 0.557643
elementType: O C H
totalener: -970.27526527 hartree
nucrepener: 1751.81015284 hartree
electener: -2722.08541811 hartree
oneelecener: -4796.45868578 hartree
twoeener: 2074.37326767 hartree
cpcmener: -0.02810540 hartree
kineticenergy: 965.60971652 hartree
xcener: -96.763548027292 hartree
chargesum: -0.0000000
charge: -0.415686 -0.300365 -0.519034 -0.127491 -0.160058 -0.183542 0.339888 0.097111 -0.118103 -0.380862 -0.335409 -0.323768 -0.143314 -0.117975 -0.153413 0.017846 -0.263711 -0.187244 0.492214 0.159751 -0.254532 -0.262407 0.068865 0.065499 0.077657 0.078031 0.069181 0.079224 0.039802 0.096478 0.081662 0.105807 0.104126 0.105268 0.098430 0.097419 0.100049 0.092817 0.085840 0.092657 0.127183 0.092924 0.090407 0.117932 0.116524 0.107524 0.105713 0.107766 0.116558 0.062672 0.088890 0.090759 0.097135 0.097277 0.092173 0.089855
qa: -0.4157 -0.3004 -0.5190 -0.1275 -0.1601 -0.1835 0.3399 0.0971 -0.1181 -0.3809 -0.3354 -0.3238 -0.1433 -0.1180 -0.1534 0.0178 -0.2637 -0.1872 0.4922 0.1598 -0.2545 -0.2624 0.0689 0.0655 0.0777 0.0780 0.0692 0.0792 0.0398 0.0965 0.0817 0.1058 0.1041 0.1053 0.0984 0.0974 0.1000 0.0928 0.0858 0.0927 0.1272 0.0929 0.0904 0.1179 0.1165 0.1075 0.1057 0.1078 0.1166 0.0627 0.0889 0.0908 0.0971 0.0973 0.0922 0.0899
va: 1.9352 2.1237 1.9751 3.8487 3.7687 3.8947 3.8169 3.7670 3.9087 3.9429 3.9265 3.9464 3.8841 3.9208 3.9016 3.7033 3.9194 3.7866 4.1416 3.8131 3.9326 3.9058 1.0087 1.0398 1.0158 1.0242 1.0133 1.0094 1.0229 1.0048 1.0152 0.9979 0.9971 1.0023 1.0093 1.0051 1.0025 1.0026 1.0009 1.0041 1.0040 0.9816 0.9834 0.9917 1.0223 0.9952 0.9965 1.0358 1.0331 1.0238 1.0067 1.0053 1.0081 1.0058 1.0175 1.0066
dispcorr: -0.023230223 hartree
energy: -970.298495490725
dipole: -20.67494 19.90912 -0.76583 9.89318 -9.62104 0.27214 1.25577 -1.08448 0.17129
magnitude: 0.83060 au
magnitude: 2.11121 debye
