program: Orca
programVersion: 5.0.2
elementType: O O O C C C C C C C C C C C C C C C C C C C H H H H H H H H H H H H H H H H H H H H H H H H H H H H H H H H H H
charge: 0
multiplicity: 1
keywords: wb97x-d3
keywords: def2-TZVPP
keywords: def2/J RIJCOSX
keywords: DEFGRID2
keywords: scfconv7
keywords: smallprint printgap noloewdin
keywords: NOSOSCF
formula: C19H34O3
InChI: InChI=1/C19H34O3/c1-15(2)22-18(20)14-17(4)11-8-10-16(3)12-9-13-19(5,6)21-7/h8,11,14-16H,9-10,12-13H2,1-7H3
56 atoms
O  -3.104222 3.536799 -1.004415
O  4.586519 -1.193296 0.691179
O  4.203935 -1.179516 -1.514476
C  -3.546413 0.834099 0.211489
C  -3.013151 2.056845 0.950454
C  -2.843048 -0.442365 0.657603
C  -3.434557 3.419476 0.381954
C  -3.313061 -1.70603 -0.064222
C  -2.299176 -2.850711 0.115485
C  -2.776747 4.530424 1.198808
C  -4.948422 3.586221 0.430137
C  -4.692257 -2.149619 0.406142
C  -1.029044 -2.580073 -0.61395
C  -1.74167 3.44491 -1.350543
C  0.153793 -2.363862 -0.028903
C  1.387115 -2.009346 -0.726786
C  1.330809 -1.907545 -2.217373
C  2.470536 -1.774812 0.04587
C  3.809162 -1.360875 -0.379662
C  5.952501 -0.755561 0.52111
C  6.001797 0.750528 0.351193
C  6.699806 -1.219201 1.752893
H  -3.399635 0.950256 -0.866632
H  -4.625299 0.746946 0.36524
H  -1.919661 2.004163 0.987692
H  -3.33766 2.019383 1.994744
H  -2.966225 -0.581838 1.738318
H  -1.769362 -0.308149 0.49301
H  -3.373035 -1.483543 -1.137021
H  -2.742597 -3.773647 -0.272705
H  -2.107481 -3.010053 1.180892
H  -3.146275 4.508442 2.224761
H  -3.005547 5.51478 0.785225
H  -1.691416 4.425993 1.246805
H  -5.46047 2.848858 -0.189692
H  -5.310431 3.470729 1.451949
H  -5.244044 4.578263 0.083416
H  -5.434249 -1.358018 0.293873
H  -4.671407 -2.435122 1.460676
H  -5.046461 -3.011208 -0.162418
H  -1.117237 -2.521527 -1.695134
H  -1.140253 4.262481 -0.940879
H  -1.683406 3.504095 -2.437661
H  -1.28032 2.50032 -1.046061
H  0.217461 -2.423442 1.054113
H  0.980186 -2.847472 -2.646365
H  0.61041 -1.142489 -2.512461
H  2.284215 -1.665212 -2.668403
H  2.352011 -1.883554 1.117739
H  6.374213 -1.242663 -0.360944
H  5.452936 1.08578 -0.528434
H  5.595143 1.257973 1.227357
H  7.037771 1.068738 0.231912
H  6.301377 -0.760973 2.659453
H  7.74884 -0.936054 1.669516
H  6.657194 -2.303031 1.863449
elementType: O C H
totalener: -970.27492001 hartree
nucrepener: 1802.62317880 hartree
electener: -2772.89809882 hartree
oneelecener: -4897.71834651 hartree
twoeener: 2124.82024770 hartree
cpcmener: -0.02829303 hartree
kineticenergy: 965.61216223 hartree
xcener: -96.763394358948 hartree
chargesum: 0.0000000
charge: -0.433234 -0.299300 -0.518521 -0.158406 -0.248512 -0.179715 0.387273 0.080668 -0.109815 -0.336922 -0.322199 -0.309247 -0.115381 -0.121920 -0.185264 0.025473 -0.264607 -0.185110 0.491171 0.158710 -0.263204 -0.254525 0.066671 0.083261 0.088679 0.094059 0.073317 0.082468 0.040297 0.094270 0.080824 0.098466 0.102282 0.099265 0.096308 0.091364 0.100478 0.089468 0.082435 0.093127 0.121777 0.096210 0.122700 0.087586 0.118832 0.106998 0.108117 0.106751 0.116416 0.063051 0.092880 0.090242 0.097558 0.088859 0.090698 0.096877
qa: -0.4332 -0.2993 -0.5185 -0.1584 -0.2485 -0.1797 0.3873 0.0807 -0.1098 -0.3369 -0.3222 -0.3092 -0.1154 -0.1219 -0.1853 0.0255 -0.2646 -0.1851 0.4912 0.1587 -0.2632 -0.2545 0.0667 0.0833 0.0887 0.0941 0.0733 0.0825 0.0403 0.0943 0.0808 0.0985 0.1023 0.0993 0.0963 0.0914 0.1005 0.0895 0.0824 0.0931 0.1218 0.0962 0.1227 0.0876 0.1188 0.1070 0.1081 0.1068 0.1164 0.0631 0.0929 0.0902 0.0976 0.0889 0.0907 0.0969
va: 1.9080 2.1242 1.9766 3.8621 3.8218 3.9077 3.7730 3.7690 3.9092 3.9199 3.9078 3.9417 3.8573 3.9199 3.9070 3.6902 3.9217 3.7810 4.1441 3.8130 3.9065 3.9336 1.0217 1.0079 0.9991 1.0122 1.0119 1.0045 1.0227 1.0057 1.0153 1.0053 1.0086 0.9987 1.0055 1.0047 1.0098 1.0047 1.0020 1.0038 1.0056 0.9853 0.9899 0.9818 1.0212 0.9963 0.9951 1.0355 1.0336 1.0233 1.0175 1.0066 1.0056 1.0068 1.0053 1.0082
dispcorr: -0.024033329 hartree
energy: -970.298953342659
dipole: -17.80749 17.36575 -0.44174 10.41607 -10.67904 -0.26297 6.51475 -5.18917 1.32559
magnitude: 1.42178 au
magnitude: 3.61388 debye
