program: Orca
programVersion: 5.0.2
elementType: O O O C C C C C C C C C C C C C C C C C C C H H H H H H H H H H H H H H H H H H H H H H H H H H H H H H H H H H
charge: 0
multiplicity: 1
keywords: wb97x-d3
keywords: def2-TZVPP
keywords: def2/J RIJCOSX
keywords: DEFGRID2
keywords: scfconv7
keywords: smallprint printgap noloewdin
keywords: NOSOSCF
formula: C19H34O3
InChI: InChI=1/C19H34O3/c1-15(2)22-18(20)14-17(4)11-8-10-16(3)12-9-13-19(5,6)21-7/h8,11,14-16H,9-10,12-13H2,1-7H3
56 atoms
O  -5.704316 3.831623 1.14189
O  5.936588 -1.844598 -0.543669
O  4.957484 -3.286143 0.859547
C  -4.085964 1.510055 0.18303
C  -5.27978 2.107158 -0.551881
C  -3.080546 0.890276 -0.780704
C  -6.313509 2.827467 0.326152
C  -1.910911 0.177271 -0.102856
C  -1.029299 -0.502187 -1.162978
C  -6.951069 1.86229 1.319361
C  -7.402701 3.424333 -0.56356
C  -1.084191 1.119318 0.76326
C  0.018974 -1.371035 -0.559363
C  -5.075999 4.902404 0.476245
C  1.334621 -1.217402 -0.742992
C  2.371804 -2.04088 -0.126232
C  1.926288 -3.131072 0.795353
C  3.651088 -1.739422 -0.440208
C  4.871178 -2.38782 0.045937
C  7.256808 -2.332543 -0.217746
C  8.136309 -1.990582 -1.400942
C  7.749551 -1.697083 1.067755
H  -4.420872 0.742962 0.88778
H  -3.596607 2.282758 0.780911
H  -5.805677 1.314993 -1.093856
H  -4.91626 2.792464 -1.32538
H  -2.689428 1.667425 -1.447913
H  -3.601555 0.172457 -1.423666
H  -2.32384 -0.610285 0.539903
H  -0.572258 0.256148 -1.806155
H  -1.670835 -1.118658 -1.802648
H  -7.732906 2.35757 1.898435
H  -6.223091 1.455801 2.022708
H  -7.409226 1.02418 0.793851
H  -7.951753 2.626578 -1.065063
H  -8.120685 4.001627 0.022458
H  -6.997795 4.073283 -1.341885
H  -1.677014 1.565402 1.561808
H  -0.669399 1.933705 0.163393
H  -0.249004 0.600991 1.236814
H  -0.348794 -2.165596 0.083972
H  -5.77945 5.534065 -0.075444
H  -4.294524 4.580961 -0.219166
H  -4.603599 5.521526 1.239286
H  1.68114 -0.415777 -1.389414
H  2.745433 -3.694899 1.222042
H  1.336862 -2.713016 1.613118
H  1.273635 -3.826703 0.265184
H  3.818135 -0.923951 -1.13451
H  7.214763 -3.418002 -0.102684
H  8.199121 -0.912281 -1.555884
H  9.145457 -2.361019 -1.222034
H  7.77223 -2.453276 -2.31855
H  7.793551 -0.610658 0.976751
H  8.756263 -2.054709 1.285383
H  7.121193 -1.947583 1.921739
elementType: O C H
totalener: -970.27589993 hartree
nucrepener: 1720.74371419 hartree
electener: -2691.01961412 hartree
oneelecener: -4734.00428018 hartree
twoeener: 2042.98466607 hartree
cpcmener: -0.02886227 hartree
kineticenergy: 965.61354394 hartree
xcener: -96.764174033068 hartree
chargesum: -0.0000000
charge: -0.434956 -0.299101 -0.519773 -0.134905 -0.258131 -0.190512 0.391426 0.114852 -0.105004 -0.323148 -0.337002 -0.345150 -0.158502 -0.124181 -0.148173 0.014876 -0.264415 -0.185567 0.492444 0.158759 -0.255282 -0.263930 0.077271 0.069355 0.091997 0.088415 0.071803 0.074877 0.043981 0.079566 0.093233 0.100940 0.097084 0.091012 0.099040 0.102495 0.099524 0.098929 0.086523 0.098165 0.127004 0.096239 0.088739 0.124143 0.115723 0.107539 0.106947 0.107126 0.116509 0.063214 0.089175 0.090851 0.097156 0.090131 0.097525 0.093142
qa: -0.4350 -0.2991 -0.5198 -0.1349 -0.2581 -0.1905 0.3914 0.1149 -0.1050 -0.3231 -0.3370 -0.3451 -0.1585 -0.1242 -0.1482 0.0149 -0.2644 -0.1856 0.4924 0.1588 -0.2553 -0.2639 0.0773 0.0694 0.0920 0.0884 0.0718 0.0749 0.0440 0.0796 0.0932 0.1009 0.0971 0.0910 0.0990 0.1025 0.0995 0.0989 0.0865 0.0982 0.1270 0.0962 0.0887 0.1241 0.1157 0.1075 0.1069 0.1071 0.1165 0.0632 0.0892 0.0909 0.0972 0.0901 0.0975 0.0931
va: 1.9042 2.1247 1.9749 3.8518 3.8474 3.9045 3.7711 3.7429 3.9187 3.9085 3.9169 3.9509 3.8897 3.9197 3.9157 3.7047 3.9214 3.7871 4.1411 3.8126 3.9326 3.9043 1.0097 1.0188 1.0124 1.0004 1.0107 1.0122 1.0230 1.0167 1.0064 1.0088 1.0059 1.0051 1.0055 1.0080 0.9980 1.0017 1.0022 1.0024 1.0040 0.9856 0.9812 0.9895 1.0230 1.0356 0.9959 0.9957 1.0334 1.0231 1.0066 1.0052 1.0082 1.0068 1.0057 1.0178
dispcorr: -0.023485247 hartree
energy: -970.299385178030
dipole: -23.10611 22.35260 -0.75351 14.36128 -13.68741 0.67387 -0.98622 -0.39171 -1.37793
magnitude: 1.70896 au
magnitude: 4.34384 debye
