program: Orca
programVersion: 5.0.2
elementType: O O O C C C C C C C C C C C C C C C C C C C H H H H H H H H H H H H H H H H H H H H H H H H H H H H H H H H H H
charge: 0
multiplicity: 1
keywords: wb97x-d3
keywords: def2-TZVPP
keywords: def2/J RIJCOSX
keywords: DEFGRID2
keywords: scfconv7
keywords: smallprint printgap noloewdin
keywords: NOSOSCF
formula: C19H34O3
InChI: InChI=1/C19H34O3/c1-15(2)22-18(20)14-17(4)11-8-10-16(3)12-9-13-19(5,6)21-7/h8,11,14-16H,9-10,12-13H2,1-7H3
56 atoms
O  -3.263316 3.546832 -1.038326
O  4.669142 -1.278068 0.693912
O  4.233643 -1.100725 -1.493767
C  -3.585116 0.839171 0.208102
C  -3.066241 2.083867 0.920061
C  -2.837626 -0.414063 0.648103
C  -3.552139 3.427251 0.357122
C  -3.291234 -1.696276 -0.051203
C  -2.254313 -2.818936 0.131087
C  -2.914249 4.566701 1.149953
C  -5.069347 3.538512 0.445993
C  -4.65621 -2.160941 0.440027
C  -0.987555 -2.524629 -0.595024
C  -1.907218 3.524668 -1.419411
C  0.198927 -2.327909 -0.010461
C  1.429149 -1.959025 -0.706457
C  1.358377 -1.800257 -2.191552
C  2.524246 -1.769035 0.062115
C  3.862005 -1.354272 -0.365137
C  6.038979 -0.854889 0.51721
C  6.114821 0.658025 0.446468
C  6.807693 -1.413696 1.695133
H  -3.469953 0.947805 -0.874696
H  -4.65686 0.72595 0.39169
H  -1.970996 2.067218 0.919677
H  -3.353512 2.043636 1.975154
H  -2.93115 -0.546519 1.732714
H  -1.772011 -0.253851 0.456304
H  -3.367104 -1.489188 -1.126099
H  -2.678619 -3.750288 -0.258967
H  -2.061797 -2.976267 1.196677
H  -3.26133 4.542149 2.183619
H  -3.184574 5.539042 0.733119
H  -1.825286 4.498501 1.175324
H  -5.570291 2.786111 -0.164721
H  -5.399588 3.404016 1.47623
H  -5.410763 4.520791 0.113745
H  -4.99537 -3.041408 -0.108446
H  -5.417174 -1.38897 0.318863
H  -4.620203 -2.425146 1.499729
H  -1.080735 -2.435707 -1.673766
H  -1.384124 2.614866 -1.10885
H  -1.343408 4.383871 -1.042727
H  -1.880729 3.563674 -2.508719
H  0.269079 -2.418899 1.069966
H  0.997463 -2.721495 -2.651503
H  0.639618 -1.020631 -2.45014
H  2.308456 -1.54707 -2.643457
H  2.418392 -1.923512 1.129713
H  6.42875 -1.289796 -0.40583
H  5.551914 1.061878 -0.394569
H  5.739969 1.113408 1.364437
H  7.15396 0.96374 0.322137
H  6.744308 -2.501409 1.735514
H  6.443514 -1.008459 2.640466
H  7.860142 -1.146977 1.601535
elementType: O C H
totalener: -970.27511358 hartree
nucrepener: 1797.53876426 hartree
electener: -2767.81387785 hartree
oneelecener: -4887.56819773 hartree
twoeener: 2119.75431988 hartree
cpcmener: -0.02825851 hartree
kineticenergy: 965.61270348 hartree
xcener: -96.763666324727 hartree
chargesum: -0.0000000
charge: -0.433053 -0.299770 -0.518749 -0.156208 -0.250440 -0.179166 0.390844 0.081749 -0.109817 -0.337945 -0.323457 -0.310658 -0.118772 -0.124085 -0.182296 0.026519 -0.265192 -0.186198 0.492167 0.159587 -0.263196 -0.254578 0.066438 0.083325 0.088384 0.093638 0.073010 0.081703 0.039933 0.094489 0.080687 0.098651 0.102623 0.099475 0.095956 0.092015 0.100200 0.093187 0.089602 0.082697 0.122227 0.089255 0.096235 0.122804 0.117991 0.107068 0.108188 0.107149 0.116393 0.062555 0.092722 0.090039 0.097624 0.096908 0.088698 0.090845
qa: -0.4331 -0.2998 -0.5187 -0.1562 -0.2504 -0.1792 0.3908 0.0817 -0.1098 -0.3379 -0.3235 -0.3107 -0.1188 -0.1241 -0.1823 0.0265 -0.2652 -0.1862 0.4922 0.1596 -0.2632 -0.2546 0.0664 0.0833 0.0884 0.0936 0.0730 0.0817 0.0399 0.0945 0.0807 0.0987 0.1026 0.0995 0.0960 0.0920 0.1002 0.0932 0.0896 0.0827 0.1222 0.0893 0.0962 0.1228 0.1180 0.1071 0.1082 0.1071 0.1164 0.0626 0.0927 0.0900 0.0976 0.0969 0.0887 0.0908
va: 1.9078 2.1242 1.9760 3.8639 3.8244 3.9049 3.7680 3.7704 3.9082 3.9192 3.9089 3.9419 3.8612 3.9200 3.9075 3.6909 3.9216 3.7835 4.1427 3.8127 3.9062 3.9334 1.0223 1.0074 0.9995 1.0124 1.0119 1.0059 1.0227 1.0055 1.0154 1.0054 1.0083 0.9982 1.0056 1.0044 1.0097 1.0037 1.0046 1.0019 1.0056 0.9814 0.9852 0.9900 1.0217 0.9960 0.9953 1.0354 1.0335 1.0233 1.0175 1.0066 1.0056 1.0082 1.0068 1.0052
dispcorr: -0.023970741 hartree
energy: -970.299084324286
dipole: -17.96979 17.56423 -0.40556 10.21754 -10.51344 -0.29590 6.44748 -5.14276 1.30472
magnitude: 1.39797 au
magnitude: 3.55337 debye
