program: Orca
programVersion: 5.0.2
elementType: O O O C C C C C C C C C C C C C C C C C C C H H H H H H H H H H H H H H H H H H H H H H H H H H H H H H H H H H
charge: 0
multiplicity: 1
keywords: wb97x-d3
keywords: def2-TZVPP
keywords: def2/J RIJCOSX
keywords: DEFGRID2
keywords: scfconv7
keywords: smallprint printgap noloewdin
keywords: NOSOSCF
formula: C19H34O3
InChI: InChI=1/C19H34O3/c1-15(2)22-18(20)14-17(4)11-8-10-16(3)12-9-13-19(5,6)21-7/h8,11,14-16H,9-10,12-13H2,1-7H3
56 atoms
O  -0.678644 1.880102 -0.044587
O  3.969859 -0.680661 0.531889
O  3.224115 0.035242 -1.450619
C  -3.215227 0.377569 0.031552
C  -2.823867 1.596308 0.861606
C  -3.806785 -0.734538 0.893252
C  -1.896165 2.600424 0.170073
C  -4.046593 -2.060441 0.15987
C  -2.785811 -2.944087 0.126842
C  -1.669789 3.788393 1.103213
C  -2.495054 3.08315 -1.149123
C  -5.183958 -2.838618 0.811132
C  -1.629546 -2.335638 -0.586746
C  0.384305 2.572392 -0.655432
C  -0.432427 -2.098751 -0.03761
C  0.681647 -1.44093 -0.714564
C  0.46824 -1.01334 -2.131613
C  1.810064 -1.252528 0.006634
C  3.035403 -0.571138 -0.413902
C  5.229227 0.006949 0.360798
C  5.080703 1.462124 0.761439
C  6.236433 -0.726474 1.218686
H  -2.344311 0.002888 -0.507227
H  -3.944805 0.659558 -0.733155
H  -2.327029 1.262439 1.779544
H  -3.725457 2.125146 1.183158
H  -4.75289 -0.378825 1.314159
H  -3.151999 -0.919412 1.752857
H  -4.334972 -1.840744 -0.875196
H  -3.045658 -3.881392 -0.378344
H  -2.502359 -3.203908 1.151328
H  -2.62127 4.268959 1.333806
H  -1.026384 4.550223 0.66026
H  -1.220439 3.472181 2.046949
H  -3.50018 3.472402 -0.981045
H  -1.910848 3.889554 -1.595304
H  -2.567828 2.277856 -1.881853
H  -6.114558 -2.269796 0.785681
H  -4.960365 -3.05762 1.857957
H  -5.363042 -3.78957 0.306104
H  -1.80973 -2.067796 -1.623736
H  0.130536 2.969546 -1.642698
H  1.199985 1.861051 -0.785998
H  0.761985 3.398738 -0.044946
H  -0.269358 -2.375003 1.000316
H  0.105604 -1.850358 -2.729351
H  -0.302043 -0.239908 -2.174295
H  1.362064 -0.62613 -2.602783
H  1.827131 -1.633416 1.021268
H  5.533435 -0.061582 -0.685712
H  4.352915 1.989024 0.144827
H  4.778521 1.55236 1.805928
H  6.03778 1.971236 0.645168
H  6.328782 -1.771842 0.923152
H  5.970773 -0.685154 2.276083
H  7.21574 -0.262837 1.102067
elementType: O C H
totalener: -970.27334349 hartree
nucrepener: 1922.58346817 hartree
electener: -2892.85681166 hartree
oneelecener: -5138.85247257 hartree
twoeener: 2245.99566091 hartree
cpcmener: -0.02797808 hartree
kineticenergy: 965.60982383 hartree
xcener: -96.765150399386 hartree
chargesum: -0.0000000
charge: -0.406859 -0.301351 -0.521495 -0.103089 -0.178651 -0.178690 0.336122 0.080475 -0.125407 -0.339142 -0.377451 -0.308034 -0.095963 -0.112258 -0.181456 -0.000266 -0.276615 -0.175651 0.490026 0.160081 -0.260948 -0.255137 0.032588 0.076675 0.077486 0.084766 0.080172 0.069813 0.043797 0.093382 0.079600 0.098637 0.099829 0.101048 0.106058 0.104418 0.103563 0.089112 0.087297 0.089361 0.132589 0.100022 0.086947 0.104980 0.116433 0.117942 0.106142 0.114034 0.115687 0.063395 0.090749 0.090520 0.097602 0.096785 0.088922 0.091409
qa: -0.4069 -0.3014 -0.5215 -0.1031 -0.1787 -0.1787 0.3361 0.0805 -0.1254 -0.3391 -0.3775 -0.3080 -0.0960 -0.1123 -0.1815 -0.0003 -0.2766 -0.1757 0.4900 0.1601 -0.2609 -0.2551 0.0326 0.0767 0.0775 0.0848 0.0802 0.0698 0.0438 0.0934 0.0796 0.0986 0.0998 0.1010 0.1061 0.1044 0.1036 0.0891 0.0873 0.0894 0.1326 0.1000 0.0869 0.1050 0.1164 0.1179 0.1061 0.1140 0.1157 0.0634 0.0907 0.0905 0.0976 0.0968 0.0889 0.0914
va: 1.9324 2.1295 1.9571 3.8314 3.7883 3.9115 3.8275 3.7568 3.9332 3.9210 3.9539 3.9371 3.8602 3.9170 3.9035 3.6869 3.9020 3.7776 4.1215 3.8096 3.9096 3.9374 1.0502 1.0136 1.0257 1.0143 1.0055 1.0096 1.0224 1.0056 1.0137 1.0054 1.0021 1.0078 1.0022 1.0013 0.9970 1.0041 0.9998 1.0046 0.9988 0.9830 1.0019 0.9912 1.0219 0.9992 0.9968 1.0336 1.0340 1.0234 1.0152 1.0069 1.0060 1.0081 1.0065 1.0049
dispcorr: -0.028095230 hartree
energy: -970.301438723330
dipole: -15.41509 14.37694 -1.03814 8.46121 -8.24336 0.21785 3.77476 -3.32150 0.45326
magnitude: 1.15353 au
magnitude: 2.93205 debye
