program: Orca
programVersion: 5.0.2
elementType: O O O C C C C C C C C C C C C C C C C C C C H H H H H H H H H H H H H H H H H H H H H H H H H H H H H H H H H H
charge: 0
multiplicity: 1
keywords: wb97x-d3
keywords: def2-TZVPP
keywords: def2/J RIJCOSX
keywords: DEFGRID2
keywords: scfconv7
keywords: smallprint printgap noloewdin
keywords: NOSOSCF
formula: C19H34O3
InChI: InChI=1/C19H34O3/c1-15(2)22-18(20)14-17(4)11-8-10-16(3)12-9-13-19(5,6)21-7/h8,11,14-16H,9-10,12-13H2,1-7H3
56 atoms
O  -1.118943 2.604929 -0.36671
O  3.757207 0.027712 -0.032623
O  3.709331 -2.122565 0.578076
C  -3.223944 0.628965 0.102517
C  -2.656519 1.622294 1.110202
C  -3.459487 -0.740856 0.727027
C  -2.176714 2.95599 0.529126
C  -3.922785 -1.818153 -0.252628
C  -2.904454 -2.062836 -1.38603
C  -1.651005 3.830496 1.666079
C  -3.312739 3.676527 -0.19394
C  -4.255448 -3.107085 0.490199
C  -1.556319 -2.479935 -0.898683
C  -0.549836 3.642127 -1.129917
C  -0.481837 -1.681983 -0.903104
C  0.839342 -2.0433 -0.396166
C  1.041026 -3.455429 0.055142
C  1.768356 -1.061685 -0.369433
C  3.15017 -1.151716 0.108723
C  5.13952 0.164674 0.363627
C  6.048251 -0.313626 -0.752427
C  5.346598 1.627624 0.687645
H  -2.537041 0.53585 -0.741339
H  -4.165909 1.000689 -0.313932
H  -1.812753 1.155964 1.632764
H  -3.405462 1.83373 1.878933
H  -4.204217 -0.648947 1.52489
H  -2.5394 -1.077342 1.218271
H  -4.839119 -1.464639 -0.738873
H  -2.812706 -1.165612 -2.001082
H  -3.305074 -2.84587 -2.037224
H  -1.310552 4.806914 1.31729
H  -0.820706 3.347004 2.185392
H  -2.439038 4.010144 2.398754
H  -3.628187 3.145852 -1.093413
H  -4.179393 3.75559 0.463747
H  -3.038142 4.691983 -0.483377
H  -5.059443 -2.945108 1.210053
H  -3.395589 -3.487395 1.046425
H  -4.580129 -3.893177 -0.194282
H  -1.477433 -3.48772 -0.501624
H  0.259625 3.201796 -1.714695
H  -0.11962 4.442353 -0.517861
H  -1.257273 4.096178 -1.831994
H  -0.583232 -0.670629 -1.289305
H  0.742719 -4.148079 -0.733377
H  2.06461 -3.675996 0.330966
H  0.405453 -3.669852 0.917111
H  1.476664 -0.081559 -0.730771
H  5.312206 -0.429667 1.263453
H  5.898503 -1.368147 -0.984248
H  5.888695 0.266085 -1.663233
H  7.089601 -0.188082 -0.454625
H  5.179436 2.261524 -0.184623
H  6.372258 1.783217 1.021479
H  4.685272 1.958463 1.489142
elementType: O C H
totalener: -970.27365471 hartree
nucrepener: 1874.33545775 hartree
electener: -2844.60911246 hartree
oneelecener: -5041.97966617 hartree
twoeener: 2197.37055370 hartree
cpcmener: -0.02737607 hartree
kineticenergy: 965.59964858 hartree
xcener: -96.763411094373 hartree
chargesum: 0.0000000
charge: -0.411219 -0.300977 -0.518327 -0.150199 -0.165324 -0.187261 0.338976 0.102594 -0.137617 -0.333036 -0.379157 -0.323994 -0.127886 -0.116528 -0.176616 0.031566 -0.267442 -0.188057 0.490478 0.158556 -0.263539 -0.254640 0.058296 0.080961 0.078162 0.083678 0.086539 0.072044 0.042894 0.095003 0.101615 0.099030 0.098230 0.097269 0.103433 0.104933 0.105468 0.093297 0.083025 0.094898 0.130496 0.112570 0.092120 0.095282 0.113743 0.105252 0.107252 0.108862 0.114474 0.062565 0.093516 0.090062 0.097440 0.088745 0.091075 0.097421
qa: -0.4112 -0.3010 -0.5183 -0.1502 -0.1653 -0.1873 0.3390 0.1026 -0.1376 -0.3330 -0.3792 -0.3240 -0.1279 -0.1165 -0.1766 0.0316 -0.2674 -0.1881 0.4905 0.1586 -0.2635 -0.2546 0.0583 0.0810 0.0782 0.0837 0.0865 0.0720 0.0429 0.0950 0.1016 0.0990 0.0982 0.0973 0.1034 0.1049 0.1055 0.0933 0.0830 0.0949 0.1305 0.1126 0.0921 0.0953 0.1137 0.1053 0.1073 0.1089 0.1145 0.0626 0.0935 0.0901 0.0974 0.0887 0.0911 0.0974
va: 1.9330 2.1242 1.9760 3.8473 3.7673 3.9045 3.8155 3.7739 3.8972 3.9251 3.9415 3.9506 3.8386 3.9220 3.9251 3.6704 3.9220 3.7933 4.1447 3.8132 3.9073 3.9327 1.0382 1.0113 1.0230 1.0164 1.0097 1.0058 1.0179 1.0058 1.0057 1.0029 1.0096 1.0051 0.9971 1.0027 0.9984 1.0047 0.9976 1.0039 0.9931 0.9894 0.9839 0.9829 1.0234 0.9968 1.0344 0.9949 1.0362 1.0243 1.0167 1.0068 1.0056 1.0067 1.0052 1.0081
dispcorr: -0.025543617 hartree
energy: -970.299198329452
dipole: -15.39394 14.02054 -1.37340 10.56975 -9.32968 1.24007 1.66391 -1.95390 -0.28999
magnitude: 1.87299 au
magnitude: 4.76076 debye
