program: Orca
programVersion: 5.0.2
elementType: O O O C C C C C C C C C C C C C C C C C C C H H H H H H H H H H H H H H H H H H H H H H H H H H H H H H H H H H
charge: 0
multiplicity: 1
keywords: wb97x-d3
keywords: def2-TZVPP
keywords: def2/J RIJCOSX
keywords: DEFGRID2
keywords: scfconv7
keywords: smallprint printgap noloewdin
keywords: NOSOSCF
formula: C19H34O3
InChI: InChI=1/C19H34O3/c1-15(2)22-18(20)14-17(4)11-8-10-16(3)12-9-13-19(5,6)21-7/h8,11,14-16H,9-10,12-13H2,1-7H3
56 atoms
O  -4.086132 3.556862 -1.126096
O  4.999428 -1.571022 0.703163
O  4.50251 -1.025251 -1.409336
C  -3.760028 0.888043 0.181658
C  -3.316454 2.21895 0.778544
C  -2.816673 -0.242953 0.574527
C  -4.085601 3.45852 0.300348
C  -3.165472 -1.600666 -0.035205
C  -2.028219 -2.609632 0.182628
C  -3.477616 4.706023 0.939495
C  -5.559229 3.368942 0.679287
C  -4.469038 -2.161224 0.519605
C  -0.772258 -2.221207 -0.518776
C  -2.83644 3.705283 -1.75874
C  0.427451 -2.116043 0.062446
C  1.661225 -1.735201 -0.620671
C  1.563786 -1.376231 -2.06891
C  2.790643 -1.739401 0.121303
C  4.14874 -1.402488 -0.310114
C  6.403041 -1.289265 0.508582
C  6.665365 0.19193 0.696999
C  7.150318 -2.14137 1.511223
H  -3.78989 0.953769 -0.910333
H  -4.779249 0.65872 0.502497
H  -2.247299 2.358438 0.585546
H  -3.408057 2.174586 1.868155
H  -2.785114 -0.340383 1.66654
H  -1.803448 0.039178 0.269219
H  -3.283535 -1.467122 -1.118026
H  -2.353371 -3.581908 -0.205321
H  -1.844316 -2.743466 1.253077
H  -3.616553 4.67583 2.02073
H  -3.957922 5.614257 0.570039
H  -2.405037 4.78931 0.756754
H  -6.092391 4.277559 0.392775
H  -6.056009 2.525247 0.198108
H  -5.667552 3.247844 1.757208
H  -4.710747 -3.12255 0.062676
H  -5.31257 -1.494997 0.336737
H  -4.399137 -2.316776 1.599007
H  -0.878015 -2.01545 -1.580552
H  -2.135998 2.896173 -1.529531
H  -2.346454 4.65422 -1.51914
H  -3.01763 3.688998 -2.833742
H  0.514651 -2.328126 1.124491
H  0.844255 -0.567304 -2.206362
H  2.507312 -1.067034 -2.499135
H  1.190556 -2.226316 -2.642663
H  2.704491 -2.028381 1.162303
H  6.690037 -1.590336 -0.501134
H  7.728334 0.3933 0.561731
H  6.122056 0.801683 -0.024484
H  6.389164 0.51571 1.701744
H  8.222274 -1.985319 1.392362
H  6.95195 -3.202799 1.360529
H  6.886561 -1.880267 2.537249
elementType: O C H
totalener: -970.27573505 hartree
nucrepener: 1775.01772910 hartree
electener: -2745.29346415 hartree
oneelecener: -4842.51548827 hartree
twoeener: 2097.22202412 hartree
cpcmener: -0.02854520 hartree
kineticenergy: 965.61551347 hartree
xcener: -96.764429039955 hartree
chargesum: -0.0000000
charge: -0.435258 -0.300767 -0.519107 -0.157008 -0.245210 -0.176060 0.388225 0.091016 -0.114617 -0.334610 -0.323747 -0.320494 -0.139262 -0.124156 -0.159316 0.020420 -0.264818 -0.188137 0.493800 0.161233 -0.264032 -0.254368 0.067970 0.084452 0.088060 0.092855 0.071400 0.079183 0.039296 0.095746 0.081133 0.099287 0.102300 0.098924 0.101214 0.095464 0.091356 0.093207 0.091553 0.084645 0.126896 0.089219 0.095908 0.123568 0.115957 0.105665 0.107514 0.108411 0.116007 0.061514 0.097359 0.093594 0.089835 0.090735 0.097118 0.088929
qa: -0.4353 -0.3008 -0.5191 -0.1570 -0.2452 -0.1761 0.3882 0.0910 -0.1146 -0.3346 -0.3237 -0.3205 -0.1393 -0.1242 -0.1593 0.0204 -0.2648 -0.1881 0.4938 0.1612 -0.2640 -0.2544 0.0680 0.0845 0.0881 0.0929 0.0714 0.0792 0.0393 0.0957 0.0811 0.0993 0.1023 0.0989 0.1012 0.0955 0.0914 0.0932 0.0916 0.0846 0.1269 0.0892 0.0959 0.1236 0.1160 0.1057 0.1075 0.1084 0.1160 0.0615 0.0974 0.0936 0.0898 0.0907 0.0971 0.0889
va: 1.9029 2.1237 1.9753 3.8671 3.8262 3.8910 3.7727 3.7759 3.9056 3.9186 3.9104 3.9447 3.8821 3.9206 3.9054 3.7000 3.9203 3.7871 4.1418 3.8107 3.9095 3.9318 1.0195 1.0060 1.0008 1.0119 1.0121 1.0095 1.0225 1.0048 1.0154 1.0054 1.0081 0.9983 1.0093 1.0057 1.0048 1.0041 1.0032 1.0013 1.0042 0.9814 0.9851 0.9894 1.0227 0.9963 1.0359 0.9952 1.0336 1.0248 1.0057 1.0163 1.0067 1.0052 1.0081 1.0068
dispcorr: -0.023716470 hartree
energy: -970.299451521380
dipole: -18.87215 18.59545 -0.27670 9.62589 -9.96621 -0.34032 5.93129 -4.76583 1.16546
magnitude: 1.24526 au
magnitude: 3.16521 debye
