program: Orca
programVersion: 5.0.2
elementType: O O O C C C C C C C C C C C C C C C C C C C H H H H H H H H H H H H H H H H H H H H H H H H H H H H H H H H H H
charge: 0
multiplicity: 1
keywords: wb97x-d3
keywords: def2-TZVPP
keywords: def2/J RIJCOSX
keywords: DEFGRID2
keywords: scfconv7
keywords: smallprint printgap noloewdin
keywords: NOSOSCF
formula: C19H34O3
InChI: InChI=1/C19H34O3/c1-15(2)22-18(20)14-17(4)11-8-10-16(3)12-9-13-19(5,6)21-7/h8,11,14-16H,9-10,12-13H2,1-7H3
56 atoms
O  -3.71099 3.529053 -1.133626
O  4.876582 -1.47976 0.691782
O  4.370881 -0.976436 -1.429082
C  -3.707406 0.854102 0.212165
C  -3.225005 2.157235 0.83985
C  -2.839204 -0.326672 0.630704
C  -3.85942 3.44101 0.285973
C  -3.228436 -1.656296 -0.016063
C  -2.120766 -2.705109 0.170862
C  -3.237003 4.6509 0.980911
C  -5.366254 3.448363 0.514663
C  -4.549553 -2.190701 0.522207
C  -0.866303 -2.331389 -0.540638
C  -2.3983 3.58241 -1.641859
C  0.332492 -2.202928 0.037495
C  1.556812 -1.798648 -0.649079
C  1.451541 -1.460971 -2.101888
C  2.68273 -1.75487 0.096771
C  4.026999 -1.361048 -0.329319
C  6.262536 -1.114577 0.511501
C  6.432512 0.378309 0.713477
C  7.050263 -1.928758 1.514648
H  -3.685061 0.929805 -0.879276
H  -4.750489 0.674391 0.484872
H  -2.135975 2.221113 0.740618
H  -3.413731 2.132553 1.917339
H  -2.857891 -0.439698 1.721424
H  -1.802116 -0.089412 0.371917
H  -3.341699 -1.488332 -1.094575
H  -2.479254 -3.660159 -0.229449
H  -1.927109 -2.860715 1.236566
H  -2.148504 4.662455 0.90371
H  -3.482351 4.63754 2.043439
H  -3.617662 5.585849 0.565064
H  -5.809044 4.387807 0.177987
H  -5.864284 2.635814 -0.016202
H  -5.590706 3.338598 1.575861
H  -5.365485 -1.481163 0.380338
H  -4.478511 -2.402038 1.591982
H  -4.834073 -3.117517 0.020898
H  -0.976067 -2.140187 -1.60463
H  -1.857808 4.484003 -1.337234
H  -2.476769 3.595948 -2.72917
H  -1.791021 2.714665 -1.365833
H  0.423249 -2.398881 1.102337
H  0.71966 -0.664837 -2.249043
H  2.38912 -1.143597 -2.539003
H  1.089757 -2.324405 -2.662768
H  2.602577 -2.035303 1.140584
H  6.576095 -1.389345 -0.497696
H  5.856692 0.95933 -0.006625
H  6.13036 0.675759 1.718876
H  7.481723 0.646405 0.58698
H  8.11195 -1.707202 1.40846
H  6.917821 -2.998815 1.352994
H  6.760891 -1.693385 2.540021
elementType: O C H
totalener: -970.27548924 hartree
nucrepener: 1785.25998466 hartree
electener: -2755.53547390 hartree
oneelecener: -4863.00060209 hartree
twoeener: 2107.46512819 hartree
cpcmener: -0.02839573 hartree
kineticenergy: 965.61764506 hartree
xcener: -96.764787022416 hartree
chargesum: 0.0000000
charge: -0.433471 -0.300672 -0.518720 -0.159052 -0.247673 -0.173384 0.387981 0.083549 -0.111295 -0.336416 -0.322790 -0.315712 -0.132476 -0.123447 -0.167805 0.024240 -0.264741 -0.188511 0.493535 0.161042 -0.264166 -0.253889 0.067344 0.084151 0.088418 0.094013 0.073043 0.079435 0.039341 0.095184 0.080685 0.099288 0.098863 0.102288 0.100620 0.095843 0.091481 0.090740 0.083480 0.093407 0.125176 0.096191 0.123114 0.088628 0.116179 0.106242 0.107237 0.108257 0.116093 0.061313 0.093738 0.089792 0.097530 0.090838 0.097089 0.088835
qa: -0.4335 -0.3007 -0.5187 -0.1591 -0.2477 -0.1734 0.3880 0.0835 -0.1113 -0.3364 -0.3228 -0.3157 -0.1325 -0.1234 -0.1678 0.0242 -0.2647 -0.1885 0.4935 0.1610 -0.2642 -0.2539 0.0673 0.0842 0.0884 0.0940 0.0730 0.0794 0.0393 0.0952 0.0807 0.0993 0.0989 0.1023 0.1006 0.0958 0.0915 0.0907 0.0835 0.0934 0.1252 0.0962 0.1231 0.0886 0.1162 0.1062 0.1072 0.1083 0.1161 0.0613 0.0937 0.0898 0.0975 0.0908 0.0971 0.0888
va: 1.9066 2.1235 1.9759 3.8636 3.8247 3.8963 3.7726 3.7777 3.9057 3.9193 3.9091 3.9433 3.8761 3.9200 3.9061 3.6954 3.9209 3.7852 4.1435 3.8111 3.9114 3.9310 1.0214 1.0068 1.0000 1.0122 1.0120 1.0082 1.0227 1.0050 1.0155 0.9983 1.0055 1.0083 1.0096 1.0054 1.0047 1.0039 1.0017 1.0037 1.0049 0.9851 0.9897 0.9815 1.0226 0.9960 1.0359 0.9953 1.0336 1.0252 1.0156 1.0067 1.0057 1.0053 1.0080 1.0069
dispcorr: -0.023853948 hartree
energy: -970.299343189816
dipole: -18.48611 18.15838 -0.32773 9.66721 -10.02345 -0.35624 6.20266 -4.96793 1.23473
magnitude: 1.32622 au
magnitude: 3.37099 debye
