program: Orca
programVersion: 5.0.2
elementType: O O O C C C C C C C C C C C C C C C C C C C H H H H H H H H H H H H H H H H H H H H H H H H H H H H H H H H H H
charge: 0
multiplicity: 1
keywords: wb97x-d3
keywords: def2-TZVPP
keywords: def2/J RIJCOSX
keywords: DEFGRID2
keywords: scfconv7
keywords: smallprint printgap noloewdin
keywords: NOSOSCF
formula: C19H34O3
InChI: InChI=1/C19H34O3/c1-15(2)22-18(20)14-17(4)11-8-10-16(3)12-9-13-19(5,6)21-7/h8,11,14-16H,9-10,12-13H2,1-7H3
56 atoms
O  -0.620731 1.838492 -0.090728
O  3.912113 -0.624584 0.549808
O  3.227035 -0.04627 -1.498121
C  -3.185606 0.377881 0.047687
C  -2.73495 1.565232 0.892532
C  -3.783669 -0.73626 0.903071
C  -1.816028 2.571797 0.193026
C  -4.056863 -2.047585 0.155359
C  -2.814294 -2.956146 0.107691
C  -1.533498 3.728032 1.150783
C  -2.45701 3.103308 -1.087023
C  -5.208365 -2.809518 0.800938
C  -1.651972 -2.36057 -0.606627
C  0.435709 2.53678 -0.705853
C  -0.456754 -2.120498 -0.054872
C  0.659527 -1.469847 -0.734735
C  0.453961 -1.062648 -2.159231
C  1.780697 -1.262005 -0.007775
C  3.008548 -0.586106 -0.430762
C  5.16789 0.06912 0.381205
C  4.985385 1.544852 0.680225
C  6.148884 -0.591415 1.324655
H  -2.342076 -0.00869 -0.524627
H  -3.928516 0.696403 -0.688898
H  -2.208228 1.195228 1.779468
H  -3.611571 2.101632 1.266312
H  -4.716597 -0.369869 1.344096
H  -3.119438 -0.944691 1.750176
H  -4.343978 -1.809833 -0.876063
H  -3.093682 -3.883867 -0.404499
H  -2.531024 -3.229693 1.128727
H  -1.052726 3.376621 2.066011
H  -2.467074 4.215598 1.433891
H  -0.896227 4.493821 0.706123
H  -2.572942 2.321115 -1.838819
H  -3.447771 3.504601 -0.869433
H  -1.876725 3.91235 -1.533416
H  -6.125941 -2.219307 0.788951
H  -4.98527 -3.049732 1.843317
H  -5.411763 -3.748431 0.282558
H  -1.82901 -2.09869 -1.645869
H  0.156187 2.988529 -1.662618
H  1.229435 1.814977 -0.90119
H  0.855324 3.322721 -0.069384
H  -0.298197 -2.386291 0.98656
H  1.351607 -0.685144 -2.631372
H  0.091033 -1.906164 -2.747604
H  -0.312867 -0.286436 -2.216507
H  1.788707 -1.617654 1.016343
H  5.513566 -0.062621 -0.646243
H  4.273674 2.020299 0.005261
H  4.643131 1.697592 1.705106
H  5.939245 2.060432 0.56623
H  6.262307 -1.653575 1.105703
H  5.8421 -0.481667 2.366044
H  7.127533 -0.125109 1.214487
elementType: O C H
totalener: -970.27321180 hartree
nucrepener: 1927.97746137 hartree
electener: -2898.25067317 hartree
oneelecener: -5149.64204639 hartree
twoeener: 2251.39137321 hartree
cpcmener: -0.02800834 hartree
kineticenergy: 965.60705933 hartree
xcener: -96.764697350934 hartree
chargesum: -0.0000000
charge: -0.405217 -0.300162 -0.521185 -0.111506 -0.176648 -0.179011 0.336097 0.079856 -0.126199 -0.340973 -0.377318 -0.308113 -0.091689 -0.109834 -0.184526 0.000943 -0.277674 -0.178262 0.490424 0.160394 -0.260673 -0.256210 0.037637 0.078043 0.077753 0.084718 0.080883 0.069630 0.044233 0.093015 0.079677 0.101468 0.098754 0.100002 0.103171 0.105842 0.104366 0.089072 0.087291 0.089563 0.132208 0.100345 0.085575 0.103822 0.116682 0.114819 0.117773 0.106287 0.115134 0.063848 0.089711 0.090816 0.097893 0.096814 0.089029 0.091613
qa: -0.4052 -0.3002 -0.5212 -0.1115 -0.1766 -0.1790 0.3361 0.0799 -0.1262 -0.3410 -0.3773 -0.3081 -0.0917 -0.1098 -0.1845 0.0009 -0.2777 -0.1783 0.4904 0.1604 -0.2607 -0.2562 0.0376 0.0780 0.0778 0.0847 0.0809 0.0696 0.0442 0.0930 0.0797 0.1015 0.0988 0.1000 0.1032 0.1058 0.1044 0.0891 0.0873 0.0896 0.1322 0.1003 0.0856 0.1038 0.1167 0.1148 0.1178 0.1063 0.1151 0.0638 0.0897 0.0908 0.0979 0.0968 0.0890 0.0916
va: 1.9350 2.1283 1.9589 3.8359 3.7846 3.9087 3.8275 3.7553 3.9349 3.9205 3.9530 3.9379 3.8549 3.9156 3.9036 3.6807 3.8999 3.7739 4.1235 3.8089 3.9090 3.9377 1.0460 1.0134 1.0257 1.0144 1.0054 1.0097 1.0223 1.0058 1.0137 1.0075 1.0056 1.0017 0.9974 1.0020 1.0015 1.0040 0.9997 1.0045 0.9989 0.9837 1.0026 0.9908 1.0219 1.0339 0.9996 0.9972 1.0344 1.0231 1.0156 1.0068 1.0061 1.0081 1.0064 1.0050
dispcorr: -0.028282701 hartree
energy: -970.301494504438
dipole: -15.34391 14.27750 -1.06641 8.83066 -8.52883 0.30183 4.06453 -3.53976 0.52477
magnitude: 1.22626 au
magnitude: 3.11691 debye
