program: Orca
programVersion: 5.0.2
elementType: O O O C C C C C C C C C C C C C C C C C C C H H H H H H H H H H H H H H H H H H H H H H H H H H H H H H H H H H
charge: 0
multiplicity: 1
keywords: wb97x-d3
keywords: def2-TZVPP
keywords: def2/J RIJCOSX
keywords: DEFGRID2
keywords: scfconv7
keywords: smallprint printgap noloewdin
keywords: NOSOSCF
formula: C19H34O3
InChI: InChI=1/C19H34O3/c1-15(2)22-18(20)14-17(4)11-8-10-16(3)12-9-13-19(5,6)21-7/h8,11,14-16H,9-10,12-13H2,1-7H3
56 atoms
O  -0.396731 2.203553 0.0015
O  3.354367 -0.222511 -0.384993
O  4.030134 -1.573857 1.264435
C  -2.866968 0.461803 -0.067709
C  -2.620729 1.635937 0.871518
C  -3.672903 -0.648882 0.600792
C  -1.684787 2.73083 0.337906
C  -3.98597 -1.855105 -0.294359
C  -2.846856 -2.888821 -0.329125
C  -1.571517 3.844665 1.376861
C  -2.213004 3.316591 -0.966119
C  -5.263895 -2.550241 0.163121
C  -1.54172 -2.344471 -0.792418
C  0.389172 1.707974 1.060221
C  -0.423442 -2.353513 -0.058683
C  0.844832 -1.732334 -0.431875
C  0.924639 -1.061394 -1.767429
C  1.831572 -1.793077 0.489446
C  3.171254 -1.203045 0.485548
C  4.622588 0.472869 -0.433483
C  4.710219 1.086912 -1.813684
C  4.6844 1.516073 0.664121
H  -1.912611 0.070614 -0.423328
H  -3.408748 0.798106 -0.956708
H  -2.230436 1.259264 1.823204
H  -3.575896 2.109746 1.118749
H  -4.617324 -0.217471 0.949154
H  -3.152789 -0.993059 1.502663
H  -4.145387 -1.492984 -1.317166
H  -3.149502 -3.696519 -1.005102
H  -2.733913 -3.332687 0.664628
H  -0.844965 4.599723 1.070188
H  -1.282603 3.472452 2.361023
H  -2.534956 4.341774 1.493181
H  -2.2243 2.580575 -1.771093
H  -3.232458 3.680037 -0.834309
H  -1.600325 4.15904 -1.292819
H  -6.119373 -1.874689 0.118022
H  -5.172938 -2.898228 1.19487
H  -5.493907 -3.417978 -0.457891
H  -1.540782 -1.897451 -1.782232
H  0.652375 2.478748 1.791174
H  1.318009 1.33994 0.625783
H  -0.080983 0.878344 1.597789
H  -0.458337 -2.805284 0.92885
H  0.41395 -1.655454 -2.52412
H  0.421921 -0.091596 -1.732926
H  1.940715 -0.900772 -2.10806
H  1.63727 -2.361295 1.392423
H  5.429609 -0.252098 -0.307452
H  4.669377 0.32739 -2.594853
H  3.906992 1.80558 -1.983427
H  5.65792 1.615039 -1.915647
H  3.882863 2.248753 0.555647
H  5.633507 2.04919 0.602298
H  4.619466 1.076459 1.658662
elementType: O C H
totalener: -970.27165168 hartree
nucrepener: 1948.24557351 hartree
electener: -2918.51722519 hartree
oneelecener: -5189.02066188 hartree
twoeener: 2270.50343669 hartree
cpcmener: -0.02937794 hartree
kineticenergy: 965.62003007 hartree
xcener: -96.766939305347 hartree
chargesum: -0.0000000
charge: -0.429805 -0.289765 -0.525334 -0.084526 -0.272550 -0.186352 0.404008 0.083258 -0.132406 -0.344722 -0.328577 -0.309923 -0.104361 -0.112188 -0.160386 -0.002986 -0.260374 -0.200333 0.492377 0.153259 -0.273829 -0.272008 0.022137 0.079343 0.087495 0.093819 0.078307 0.073952 0.043650 0.093071 0.078799 0.103370 0.100057 0.100459 0.097146 0.094034 0.101699 0.089619 0.087376 0.089724 0.133182 0.112317 0.084896 0.093382 0.115010 0.113054 0.110476 0.105899 0.114785 0.074966 0.100128 0.093409 0.099938 0.089904 0.106925 0.095194
qa: -0.4298 -0.2898 -0.5253 -0.0845 -0.2726 -0.1864 0.4040 0.0833 -0.1324 -0.3447 -0.3286 -0.3099 -0.1044 -0.1122 -0.1604 -0.0030 -0.2604 -0.2003 0.4924 0.1533 -0.2738 -0.2720 0.0221 0.0793 0.0875 0.0938 0.0783 0.0740 0.0437 0.0931 0.0788 0.1034 0.1001 0.1005 0.0971 0.0940 0.1017 0.0896 0.0874 0.0897 0.1332 0.1123 0.0849 0.0934 0.1150 0.1131 0.1105 0.1059 0.1148 0.0750 0.1001 0.0934 0.0999 0.0899 0.1069 0.0952
va: 1.9079 2.1121 1.9651 3.8337 3.8584 3.9087 3.7461 3.7538 3.9367 3.9179 3.9206 3.9363 3.8673 3.9165 3.8648 3.7146 3.9143 3.8389 4.1157 3.8036 3.9353 3.9068 1.0440 1.0137 1.0026 1.0128 1.0063 1.0086 1.0226 1.0058 1.0129 1.0080 0.9975 1.0055 1.0027 1.0042 1.0085 1.0042 1.0002 1.0041 0.9991 0.9904 1.0070 0.9798 1.0219 1.0013 1.0090 1.0193 1.0339 1.0231 1.0060 1.0042 1.0064 1.0020 1.0070 1.0186
dispcorr: -0.029638372 hartree
energy: -970.301290051231
dipole: -18.24364 16.47643 -1.76722 12.23446 -11.40161 0.83285 -1.61905 0.89687 -0.72218
magnitude: 2.08284 au
magnitude: 5.29417 debye
