program: Orca
programVersion: 5.0.2
elementType: O O O C C C C C C C C C C C C C C C C C C C H H H H H H H H H H H H H H H H H H H H H H H H H H H H H H H H H H
charge: 0
multiplicity: 1
keywords: wb97x-d3
keywords: def2-TZVPP
keywords: def2/J RIJCOSX
keywords: DEFGRID2
keywords: scfconv7
keywords: smallprint printgap noloewdin
keywords: NOSOSCF
formula: C19H34O3
InChI: InChI=1/C19H34O3/c1-15(2)22-18(20)14-17(4)11-8-10-16(3)12-9-13-19(5,6)21-7/h8,11,14-16H,9-10,12-13H2,1-7H3
56 atoms
O  -1.100717 2.370758 0.443418
O  4.091719 -0.59318 -0.639458
O  3.255387 0.215118 1.272142
C  -3.242044 0.33943 -0.130844
C  -3.019134 1.634827 -0.902488
C  -3.778303 -0.769819 -1.03188
C  -2.358293 2.771189 -0.109445
C  -3.935003 -2.154721 -0.387629
C  -2.622316 -2.961588 -0.355913
C  -3.202536 3.157629 1.100083
C  -2.195275 3.991041 -1.014863
C  -4.605586 -2.099876 0.980626
C  -1.502018 -2.323061 0.390055
C  -0.098117 1.96829 -0.46071
C  -0.299499 -2.06795 -0.1392
C  0.79054 -1.380921 0.545911
C  0.538236 -0.912457 1.943628
C  1.927386 -1.186008 -0.159039
C  3.120773 -0.451964 0.265006
C  5.365904 0.049676 -0.414964
C  6.222179 -0.803775 0.50034
C  5.99484 0.239251 -1.778004
H  -3.946261 0.513491 0.686037
H  -2.307228 0.025281 0.336328
H  -3.979355 2.005981 -1.27446
H  -2.42473 1.424912 -1.798404
H  -3.132484 -0.864842 -1.911914
H  -4.755155 -0.456339 -1.414217
H  -4.598489 -2.727437 -1.043542
H  -2.304638 -3.171109 -1.380539
H  -2.841224 -3.930316 0.108631
H  -4.218752 3.40351 0.791532
H  -2.787819 4.033322 1.602997
H  -3.263059 2.350707 1.831533
H  -1.673666 3.757916 -1.944455
H  -3.174343 4.386411 -1.288096
H  -1.647603 4.787387 -0.507164
H  -3.988096 -1.607205 1.733179
H  -4.822717 -3.10533 1.345442
H  -5.552042 -1.557914 0.932738
H  -1.703138 -2.056078 1.422875
H  -0.365137 1.07225 -1.029608
H  0.790552 1.737914 0.127621
H  0.173155 2.752983 -1.173784
H  -0.114349 -2.349716 -1.172039
H  1.421362 -0.520202 2.430798
H  -0.224223 -0.129479 1.941074
H  0.148486 -1.727385 2.554165
H  1.977202 -1.596836 -1.160908
H  5.19476 1.027453 0.040201
H  6.404667 -1.785878 0.061355
H  7.187577 -0.32069 0.652113
H  5.766946 -0.942781 1.480585
H  6.176435 -0.715557 -2.273572
H  6.953894 0.744428 -1.666361
H  5.370686 0.854728 -2.426158
elementType: O C H
totalener: -970.27263114 hartree
nucrepener: 1916.40932320 hartree
electener: -2886.68195434 hartree
oneelecener: -5125.79514337 hartree
twoeener: 2239.11318903 hartree
cpcmener: -0.02809855 hartree
kineticenergy: 965.61130607 hartree
xcener: -96.768617689920 hartree
chargesum: 0.0000000
charge: -0.430864 -0.301413 -0.525293 -0.122796 -0.247358 -0.196808 0.401971 0.082119 -0.125458 -0.330438 -0.342934 -0.327087 -0.125473 -0.121226 -0.169587 -0.006845 -0.272237 -0.185740 0.507277 0.158510 -0.263548 -0.255232 0.092162 0.027478 0.093448 0.088417 0.075194 0.087643 0.052395 0.085469 0.096254 0.093050 0.102261 0.095843 0.099698 0.100067 0.102175 0.078838 0.098059 0.097736 0.139362 0.086523 0.106581 0.113300 0.116383 0.112400 0.108456 0.114830 0.115439 0.063452 0.090107 0.097385 0.092838 0.089282 0.090739 0.097200
qa: -0.4309 -0.3014 -0.5253 -0.1228 -0.2474 -0.1968 0.4020 0.0821 -0.1255 -0.3304 -0.3429 -0.3271 -0.1255 -0.1212 -0.1696 -0.0068 -0.2722 -0.1857 0.5073 0.1585 -0.2635 -0.2552 0.0922 0.0275 0.0934 0.0884 0.0752 0.0876 0.0524 0.0855 0.0963 0.0930 0.1023 0.0958 0.0997 0.1001 0.1022 0.0788 0.0981 0.0977 0.1394 0.0865 0.1066 0.1133 0.1164 0.1124 0.1085 0.1148 0.1154 0.0635 0.0901 0.0974 0.0928 0.0893 0.0907 0.0972
va: 1.9073 2.1321 1.9529 3.8322 3.8360 3.9493 3.7458 3.7871 3.9271 3.9176 3.9199 3.9610 3.8572 3.9140 3.8682 3.6933 3.8992 3.7723 4.0963 3.8125 3.9070 3.9340 1.0018 1.0270 1.0126 1.0022 1.0092 1.0043 1.0129 1.0139 1.0049 1.0043 1.0081 1.0044 0.9983 1.0049 1.0096 0.9956 1.0056 1.0011 0.9882 0.9765 1.0021 0.9899 1.0223 1.0323 1.0039 0.9982 1.0342 1.0237 1.0069 1.0060 1.0172 1.0065 1.0053 1.0079
dispcorr: -0.028765125 hartree
energy: -970.301396266026
dipole: -15.23243 14.19463 -1.03780 4.84222 -5.52943 -0.68721 -3.14829 1.73030 -1.41798
magnitude: 1.88679 au
magnitude: 4.79584 debye
