program: Orca
programVersion: 5.0.2
elementType: O O O C C C C C C C C C C C C C C C C C C C H H H H H H H H H H H H H H H H H H H H H H H H H H H H H H H H H H
charge: 0
multiplicity: 1
keywords: wb97x-d3
keywords: def2-TZVPP
keywords: def2/J RIJCOSX
keywords: DEFGRID2
keywords: scfconv7
keywords: smallprint printgap noloewdin
keywords: NOSOSCF
formula: C19H34O3
InChI: InChI=1/C19H34O3/c1-15(2)22-18(20)14-17(4)11-8-10-16(3)12-9-13-19(5,6)21-7/h8,11,14-16H,9-10,12-13H2,1-7H3
56 atoms
O  -0.574113 1.827975 -0.135123
O  3.869167 -0.602901 0.556775
O  3.219213 -0.081449 -1.518792
C  -3.145351 0.37809 0.077914
C  -2.648185 1.542285 0.929542
C  -3.730328 -0.744386 0.931636
C  -1.753755 2.560061 0.213318
C  -4.053302 -2.034413 0.165833
C  -2.834972 -2.972691 0.076006
C  -1.424527 3.693971 1.183048
C  -2.446242 3.123031 -1.02576
C  -5.210612 -2.78044 0.819669
C  -1.670023 -2.385903 -0.640949
C  0.446952 2.529015 -0.803761
C  -0.475227 -2.147507 -0.087537
C  0.644179 -1.498135 -0.764234
C  0.448712 -1.105306 -2.193846
C  1.756205 -1.274973 -0.027567
C  2.985292 -0.596186 -0.442235
C  5.114848 0.114111 0.407435
C  4.894598 1.58785 0.690217
C  6.090176 -0.517664 1.376832
H  -2.326958 -0.008624 -0.530432
H  -3.909125 0.721289 -0.625972
H  -2.085693 1.14787 1.783285
H  -3.503481 2.075971 1.353794
H  -4.640305 -0.372406 1.413648
H  -3.039334 -0.98187 1.749077
H  -4.354986 -1.769992 -0.854778
H  -3.14556 -3.88051 -0.453105
H  -2.543274 -3.275975 1.086026
H  -0.909385 3.31944 2.069998
H  -2.342121 4.181873 1.513711
H  -0.799714 4.464293 0.72838
H  -2.596009 2.35957 -1.790734
H  -3.426068 3.519942 -0.756542
H  -1.883244 3.94211 -1.475961
H  -6.114021 -2.168923 0.834818
H  -4.974329 -3.04449 1.853213
H  -5.445248 -3.704797 0.288597
H  -1.845819 -2.122594 -1.67985
H  1.239452 1.813302 -1.022771
H  0.883953 3.328695 -0.197371
H  0.121394 2.963616 -1.753625
H  -0.32035 -2.411591 0.954831
H  -0.309504 -0.321501 -2.261853
H  1.351965 -0.742403 -2.666565
H  0.07859 -1.951224 -2.773842
H  1.752187 -1.617813 1.000681
H  5.483979 -0.018658 -0.611573
H  4.183775 2.040606 -0.001004
H  4.532416 1.74176 1.707905
H  5.838625 2.123328 0.586946
H  6.232101 -1.5784 1.168773
H  5.759235 -0.406668 2.410597
H  7.060134 -0.029904 1.283023
elementType: O C H
totalener: -970.27316205 hartree
nucrepener: 1931.23218502 hartree
electener: -2901.50534707 hartree
oneelecener: -5156.16154534 hartree
twoeener: 2254.65619827 hartree
cpcmener: -0.02808555 hartree
kineticenergy: 965.60247305 hartree
xcener: -96.763679062854 hartree
chargesum: 0.0000000
charge: -0.404260 -0.299898 -0.520831 -0.117003 -0.175396 -0.179252 0.337855 0.080204 -0.127940 -0.340792 -0.378353 -0.308960 -0.089254 -0.111877 -0.183606 -0.000532 -0.277327 -0.178012 0.489248 0.160171 -0.259759 -0.256200 0.041057 0.078683 0.077961 0.084328 0.081843 0.069568 0.044506 0.092546 0.079739 0.101158 0.098392 0.099627 0.103163 0.105711 0.104347 0.089226 0.087471 0.089543 0.131794 0.087517 0.103579 0.100362 0.116447 0.106707 0.114638 0.117440 0.114788 0.063815 0.089142 0.090915 0.098015 0.096983 0.089124 0.091638
qa: -0.4043 -0.2999 -0.5208 -0.1170 -0.1754 -0.1793 0.3379 0.0802 -0.1279 -0.3408 -0.3784 -0.3090 -0.0893 -0.1119 -0.1836 -0.0005 -0.2773 -0.1780 0.4892 0.1602 -0.2598 -0.2562 0.0411 0.0787 0.0780 0.0843 0.0818 0.0696 0.0445 0.0925 0.0797 0.1012 0.0984 0.0996 0.1032 0.1057 0.1043 0.0892 0.0875 0.0895 0.1318 0.0875 0.1036 0.1004 0.1164 0.1067 0.1146 0.1174 0.1148 0.0638 0.0891 0.0909 0.0980 0.0970 0.0891 0.0916
va: 1.9362 2.1276 1.9594 3.8385 3.7806 3.9047 3.8256 3.7517 3.9379 3.9219 3.9515 3.9388 3.8502 3.9146 3.8995 3.6791 3.9001 3.7722 4.1255 3.8090 3.9108 3.9370 1.0440 1.0131 1.0259 1.0145 1.0053 1.0099 1.0224 1.0061 1.0133 1.0079 1.0054 1.0021 0.9974 1.0020 1.0010 1.0039 0.9997 1.0045 0.9991 1.0024 0.9905 0.9839 1.0222 0.9966 1.0336 0.9998 1.0346 1.0233 1.0153 1.0068 1.0063 1.0081 1.0064 1.0050
dispcorr: -0.028369793 hartree
energy: -970.301531847295
dipole: -15.31071 14.21711 -1.09360 9.04992 -8.70121 0.34871 4.30974 -3.75425 0.55549
magnitude: 1.27520 au
magnitude: 3.24130 debye
