program: Orca
programVersion: 5.0.2
elementType: O O O C C C C C C C C C C C C C C C C C C C H H H H H H H H H H H H H H H H H H H H H H H H H H H H H H H H H H
charge: 0
multiplicity: 1
keywords: wb97x-d3
keywords: def2-TZVPP
keywords: def2/J RIJCOSX
keywords: DEFGRID2
keywords: scfconv7
keywords: smallprint printgap noloewdin
keywords: NOSOSCF
formula: C19H34O3
InChI: InChI=1/C19H34O3/c1-15(2)22-18(20)14-17(4)11-8-10-16(3)12-9-13-19(5,6)21-7/h8,11,14-16H,9-10,12-13H2,1-7H3
56 atoms
O  -1.018925 1.210327 1.222247
O  3.589272 -0.129093 0.472082
O  3.348666 -0.69142 -1.680203
C  -3.157972 0.561833 -0.63614
C  -2.772444 1.973043 -0.173404
C  -3.744899 -0.322824 0.462759
C  -1.312362 2.204447 0.243397
C  -4.130002 -1.738828 0.007861
C  -2.975919 -2.744487 0.174544
C  -1.194595 3.614252 0.82337
C  -0.378603 2.068877 -0.959726
C  -5.345147 -2.245948 0.777692
C  -1.75582 -2.39708 -0.604324
C  0.193327 1.328695 1.923375
C  -0.579543 -2.074171 -0.056896
C  0.606519 -1.650093 -0.795347
C  0.526918 -1.64384 -2.288558
C  1.665575 -1.251046 -0.058881
C  2.927493 -0.685395 -0.543781
C  4.830233 0.560515 0.217709
C  4.54865 1.96272 -0.287471
C  5.589726 0.561202 1.527219
H  -2.307404 0.070652 -1.113857
H  -3.91344 0.651248 -1.422629
H  -3.425241 2.270023 0.655621
H  -2.97967 2.683788 -0.977431
H  -4.639818 0.179892 0.845102
H  -3.060627 -0.390013 1.312902
H  -4.397935 -1.704121 -1.055564
H  -3.332177 -3.728079 -0.151741
H  -2.730529 -2.833024 1.237321
H  -1.569305 4.345455 0.105521
H  -0.162949 3.890254 1.049125
H  -1.783096 3.720101 1.737509
H  -0.433989 1.076944 -1.410735
H  -0.644269 2.796475 -1.72819
H  0.664617 2.252275 -0.694768
H  -6.213924 -1.606871 0.610471
H  -5.152445 -2.263185 1.853467
H  -5.61979 -3.259168 0.47693
H  -1.871457 -2.388578 -1.684568
H  1.073112 1.391561 1.274772
H  0.299179 0.433135 2.536751
H  0.212037 2.190944 2.598861
H  -0.489473 -2.085421 1.025828
H  1.424508 -1.268859 -2.764441
H  0.344248 -2.654455 -2.659644
H  -0.315308 -1.033341 -2.620265
H  1.56911 -1.286846 1.020177
H  5.401502 0.00488 -0.529845
H  4.0036 1.95997 -1.231534
H  3.972311 2.534846 0.442299
H  5.489534 2.48811 -0.456265
H  5.774877 -0.453266 1.882676
H  5.052319 1.107596 2.304428
H  6.557558 1.043604 1.388672
elementType: O C H
totalener: -970.28293193 hartree
nucrepener: 1975.98138707 hartree
electener: -2946.26431901 hartree
oneelecener: -5245.08148325 hartree
twoeener: 2298.81716424 hartree
cpcmener: -0.02245751 hartree
kineticenergy: 965.59666752 hartree
xcener: -96.761134162248 hartree
chargesum: 0.0000000
charge: -0.383390 -0.289622 -0.485005 -0.104477 -0.174550 -0.195945 0.345889 0.074867 -0.124815 -0.340136 -0.381408 -0.307598 -0.083862 -0.124091 -0.208145 0.019600 -0.271127 -0.185599 0.462602 0.157784 -0.275400 -0.255009 0.047721 0.082630 0.075115 0.096211 0.073814 0.073707 0.042447 0.090341 0.078310 0.100059 0.099786 0.099637 0.086210 0.108081 0.102639 0.088323 0.088308 0.087436 0.127904 0.065848 0.110859 0.112037 0.114272 0.112371 0.118595 0.101301 0.113780 0.067328 0.095956 0.089749 0.104212 0.096657 0.088122 0.089671
qa: -0.3834 -0.2896 -0.4850 -0.1045 -0.1745 -0.1959 0.3459 0.0749 -0.1248 -0.3401 -0.3814 -0.3076 -0.0839 -0.1241 -0.2081 0.0196 -0.2711 -0.1856 0.4626 0.1578 -0.2754 -0.2550 0.0477 0.0826 0.0751 0.0962 0.0738 0.0737 0.0424 0.0903 0.0783 0.1001 0.0998 0.0996 0.0862 0.1081 0.1026 0.0883 0.0883 0.0874 0.1279 0.0658 0.1109 0.1120 0.1143 0.1124 0.1186 0.1013 0.1138 0.0673 0.0960 0.0897 0.1042 0.0967 0.0881 0.0897
va: 1.9497 2.1148 2.0136 3.8438 3.8283 3.8795 3.8112 3.7502 3.9367 3.9147 3.9725 3.9428 3.8269 3.9329 3.9080 3.6333 3.9094 3.7666 4.1650 3.8126 3.9049 3.9385 1.0292 1.0112 1.0160 1.0107 1.0083 1.0309 1.0221 1.0068 1.0134 1.0064 0.9981 1.0075 0.9944 1.0116 0.9967 1.0040 0.9997 1.0049 0.9997 0.9863 0.9920 0.9902 1.0217 1.0344 0.9967 0.9915 1.0304 1.0246 1.0167 1.0043 1.0076 1.0084 1.0060 1.0058
dispcorr: -0.030865604 hartree
energy: -970.313797536288
dipole: -12.69253 12.16835 -0.52418 10.19303 -9.49787 0.69516 3.50021 -3.04528 0.45492
magnitude: 0.98233 au
magnitude: 2.49687 debye
