program: Orca
programVersion: 5.0.2
elementType: O O O C C C C C C C C C C C C C C C C C C C H H H H H H H H H H H H H H H H H H H H H H H H H H H H H H H H H H
charge: 0
multiplicity: 1
keywords: wb97x-d3
keywords: def2-TZVPP
keywords: def2/J RIJCOSX
keywords: DEFGRID2
keywords: scfconv7
keywords: smallprint printgap noloewdin
keywords: NOSOSCF
formula: C19H34O3
InChI: InChI=1/C19H34O3/c1-15(2)22-18(20)14-17(4)11-8-10-16(3)12-9-13-19(5,6)21-7/h8,11,14-16H,9-10,12-13H2,1-7H3
56 atoms
O  -1.879393 3.985464 1.287478
O  4.188172 -0.481862 -0.769696
O  3.870562 -2.085603 0.756268
C  -3.074267 0.651864 -0.139732
C  -2.740921 1.75292 0.861963
C  -3.465469 -0.644945 0.559052
C  -2.346681 3.10919 0.257361
C  -3.836036 -1.794581 -0.378765
C  -2.700746 -2.15206 -1.356663
C  -3.512918 3.737055 -0.504413
C  -1.144577 2.969495 -0.669221
C  -4.291386 -3.010522 0.421797
C  -1.408812 -2.464361 -0.680238
C  -2.781293 4.353514 2.30051
C  -0.267007 -1.805228 -0.906188
C  1.00956 -2.074336 -0.247889
C  1.038805 -3.161105 0.778791
C  2.059135 -1.311539 -0.623629
C  3.434776 -1.367194 -0.117618
C  5.578846 -0.335935 -0.415403
C  6.273002 0.219961 -1.640588
C  5.714586 0.576211 0.788778
H  -2.213575 0.473725 -0.788313
H  -3.893245 0.966152 -0.794753
H  -1.915976 1.410962 1.497609
H  -3.60455 1.88753 1.521725
H  -4.317597 -0.449637 1.21917
H  -2.64702 -0.963501 1.215676
H  -4.681688 -1.468697 -0.995455
H  -2.553748 -1.343949 -2.076774
H  -3.017827 -3.025518 -1.93797
H  -3.266542 4.750387 -0.829052
H  -4.426689 3.785168 0.090938
H  -3.746391 3.159606 -1.399328
H  -0.79972 3.950318 -1.002703
H  -0.310875 2.470066 -0.170479
H  -1.391307 2.393935 -1.560681
H  -3.50791 -3.380442 1.086803
H  -4.58501 -3.834115 -0.232236
H  -5.153296 -2.766579 1.04585
H  -1.425607 -3.276751 0.039879
H  -2.260376 5.06109 2.947465
H  -3.102355 3.513855 2.925881
H  -3.678634 4.854879 1.92272
H  -0.267582 -0.997639 -1.633722
H  2.015894 -3.306084 1.221672
H  0.330996 -2.940602 1.580342
H  0.723678 -4.107068 0.334015
H  1.888062 -0.561427 -1.387642
H  5.992839 -1.319835 -0.182593
H  7.339403 0.325435 -1.440196
H  6.163206 -0.443663 -2.499156
H  5.885566 1.203721 -1.911453
H  5.30935 1.567842 0.579157
H  6.768671 0.693537 1.043321
H  5.209044 0.176302 1.667771
elementType: O C H
totalener: -970.28694720 hartree
nucrepener: 1837.38242227 hartree
electener: -2807.66936946 hartree
oneelecener: -4967.20324902 hartree
twoeener: 2159.53387956 hartree
cpcmener: -0.02345610 hartree
kineticenergy: 965.59601359 hartree
xcener: -96.760459443106 hartree
chargesum: -0.0000000
charge: -0.391160 -0.293488 -0.489023 -0.161491 -0.215454 -0.182585 0.379201 0.080758 -0.127749 -0.365478 -0.324063 -0.311881 -0.140553 -0.123741 -0.161166 0.024013 -0.266448 -0.184466 0.470076 0.157739 -0.251888 -0.264253 0.064444 0.084876 0.083126 0.083510 0.084048 0.073047 0.043670 0.089035 0.100149 0.105895 0.100921 0.094600 0.100225 0.100388 0.086108 0.080530 0.093257 0.092226 0.132412 0.119078 0.087950 0.087051 0.111431 0.109726 0.104772 0.104168 0.112841 0.061906 0.089109 0.095833 0.087746 0.089314 0.095400 0.094313
qa: -0.3912 -0.2935 -0.4890 -0.1615 -0.2155 -0.1826 0.3792 0.0808 -0.1277 -0.3655 -0.3241 -0.3119 -0.1406 -0.1237 -0.1612 0.0240 -0.2664 -0.1845 0.4701 0.1577 -0.2519 -0.2643 0.0644 0.0849 0.0831 0.0835 0.0840 0.0730 0.0437 0.0890 0.1001 0.1059 0.1009 0.0946 0.1002 0.1004 0.0861 0.0805 0.0933 0.0922 0.1324 0.1191 0.0879 0.0871 0.1114 0.1097 0.1048 0.1042 0.1128 0.0619 0.0891 0.0958 0.0877 0.0893 0.0954 0.0943
va: 1.9617 2.1283 2.0119 3.9014 3.8594 3.9004 3.8339 3.7887 3.8970 3.9299 3.9054 3.9510 3.8418 3.9382 3.9101 3.6872 3.9179 3.7841 4.1728 3.8188 3.9320 3.9084 1.0004 1.0091 1.0198 1.0059 1.0105 1.0069 1.0174 1.0058 1.0049 1.0087 0.9973 1.0021 1.0158 1.0080 0.9996 1.0011 1.0052 1.0047 0.9912 0.9903 0.9803 0.9807 1.0222 1.0372 0.9965 0.9959 1.0346 1.0242 1.0056 1.0085 1.0069 1.0067 1.0059 1.0167
dispcorr: -0.025087307 hartree
energy: -970.312034503870
dipole: -18.06786 16.50825 -1.55961 8.14592 -8.09315 0.05277 0.95323 -1.63771 -0.68448
magnitude: 1.70402 au
magnitude: 4.33127 debye
