program: Orca
programVersion: 5.0.2
elementType: O O O C C C C C C C C C C C C C C C C C C C H H H H H H H H H H H H H H H H H H H H H H H H H H H H H H H H H H
charge: 0
multiplicity: 1
keywords: wb97x-d3
keywords: def2-TZVPP
keywords: def2/J RIJCOSX
keywords: DEFGRID2
keywords: scfconv7
keywords: smallprint printgap noloewdin
keywords: NOSOSCF
formula: C19H34O3
InChI: InChI=1/C19H34O3/c1-15(2)22-18(20)14-17(4)11-8-10-16(3)12-9-13-19(5,6)21-7/h8,11,14-16H,9-10,12-13H2,1-7H3
56 atoms
O  -0.382235 3.104613 0.873236
O  3.381518 -0.109935 0.543664
O  2.965958 -0.140875 -1.65359
C  -2.915309 0.364637 0.052769
C  -1.926355 1.243367 0.811844
C  -3.506343 -0.72053 0.956163
C  -1.349467 2.445405 0.048638
C  -4.085728 -1.935528 0.216885
C  -3.021356 -3.03438 0.013437
C  -2.426313 3.500354 -0.178991
C  -0.746195 2.035567 -1.292635
C  -5.271591 -2.52689 0.970368
C  -1.825694 -2.571675 -0.744629
C  0.859358 2.471744 1.064591
C  -0.638597 -2.312397 -0.185925
C  0.492511 -1.701074 -0.876481
C  0.418759 -1.589306 -2.36649
C  1.492045 -1.230949 -0.098833
C  2.663017 -0.459244 -0.523762
C  4.573553 0.681647 0.366399
C  4.779337 1.426232 1.668028
C  5.745843 -0.216249 0.017686
H  -2.412052 -0.09411 -0.800407
H  -3.731823 0.960926 -0.365582
H  -1.105887 0.595926 1.139928
H  -2.400883 1.61727 1.72659
H  -4.283433 -0.264945 1.577788
H  -2.741624 -1.06878 1.660671
H  -4.438699 -1.612603 -0.769988
H  -3.483743 -3.871562 -0.519664
H  -2.718462 -3.408935 0.996464
H  -2.850512 3.843599 0.767398
H  -3.243655 3.107801 -0.783719
H  -2.021398 4.369508 -0.702261
H  -0.257553 2.885838 -1.774025
H  -0.010826 1.233926 -1.201886
H  -1.523845 1.686222 -1.972345
H  -6.08073 -1.800583 1.066376
H  -4.984322 -2.834174 1.979414
H  -5.676084 -3.404921 0.462292
H  -1.97689 -2.387769 -1.804779
H  1.406973 3.067995 1.79643
H  1.463599 2.43089 0.15195
H  0.778705 1.45637 1.466281
H  -0.516143 -2.480932 0.880769
H  0.127008 -2.546281 -2.803328
H  -0.347172 -0.86436 -2.656592
H  1.355082 -1.280591 -2.816966
H  1.41506 -1.385163 0.972038
H  4.408578 1.402102 -0.438885
H  3.931619 2.074683 1.896114
H  4.923486 0.740662 2.505495
H  5.666388 2.056031 1.5960
H  5.586574 -0.757318 -0.915595
H  5.934208 -0.944263 0.80981
H  6.647191 0.386133 -0.10465
elementType: O C H
totalener: -970.28437309 hartree
nucrepener: 1963.59955628 hartree
electener: -2933.88392937 hartree
oneelecener: -5219.41234575 hartree
twoeener: 2285.52841638 hartree
cpcmener: -0.02265710 hartree
kineticenergy: 965.58240778 hartree
xcener: -96.758246596068 hartree
chargesum: -0.0000000
charge: -0.401800 -0.292316 -0.489828 -0.141716 -0.279923 -0.199720 0.435433 0.079505 -0.133241 -0.309549 -0.355443 -0.310455 -0.081664 -0.132012 -0.201309 0.029252 -0.267038 -0.212510 0.483373 0.147759 -0.249404 -0.265354 0.075989 0.098096 0.078363 0.087428 0.085902 0.070881 0.049501 0.088646 0.081037 0.096373 0.088142 0.097290 0.113102 0.057939 0.100812 0.089131 0.087428 0.088528 0.129619 0.120274 0.092550 0.084073 0.115626 0.114624 0.102632 0.114051 0.117382 0.066426 0.094664 0.088966 0.091759 0.094823 0.089415 0.096488
qa: -0.4018 -0.2923 -0.4898 -0.1417 -0.2799 -0.1997 0.4354 0.0795 -0.1332 -0.3095 -0.3554 -0.3105 -0.0817 -0.1320 -0.2013 0.0293 -0.2670 -0.2125 0.4834 0.1478 -0.2494 -0.2654 0.0760 0.0981 0.0784 0.0874 0.0859 0.0709 0.0495 0.0886 0.0810 0.0964 0.0881 0.0973 0.1131 0.0579 0.1008 0.0891 0.0874 0.0885 0.1296 0.1203 0.0926 0.0841 0.1156 0.1146 0.1026 0.1141 0.1174 0.0664 0.0947 0.0890 0.0918 0.0948 0.0894 0.0965
va: 1.9718 2.1193 2.0010 3.8246 3.9361 3.8910 3.7614 3.7438 3.9359 3.9081 3.9386 3.9479 3.8173 3.9688 3.9131 3.6266 3.9004 3.7573 4.1328 3.8145 3.9338 3.9191 1.0007 1.0064 1.0026 1.0230 1.0068 1.0095 1.0209 1.0090 1.0116 1.0110 1.0035 1.0114 1.0119 1.0114 0.9993 1.0039 0.9996 1.0047 0.9992 0.9946 0.9803 0.9716 1.0211 0.9998 0.9951 1.0334 1.0326 1.0224 1.0058 1.0071 1.0069 1.0161 1.0066 1.0058
dispcorr: -0.030986832 hartree
energy: -970.315359923402
dipole: -12.44820 11.67781 -0.77040 2.87456 -3.79930 -0.92474 3.00716 -2.69815 0.30901
magnitude: 1.24263 au
magnitude: 3.15852 debye
