program: Orca
programVersion: 5.0.2
elementType: O O O C C C C C C C C C C C C C C C C C C C H H H H H H H H H H H H H H H H H H H H H H H H H H H H H H H H H H
charge: 0
multiplicity: 1
keywords: wb97x-d3
keywords: def2-TZVPP
keywords: def2/J RIJCOSX
keywords: DEFGRID2
keywords: scfconv7
keywords: smallprint printgap noloewdin
keywords: NOSOSCF
formula: C19H34O3
InChI: InChI=1/C19H34O3/c1-15(2)22-18(20)14-17(4)11-8-10-16(3)12-9-13-19(5,6)21-7/h8,11,14-16H,9-10,12-13H2,1-7H3
56 atoms
O  -3.088268 3.809341 1.356681
O  4.649093 -0.580254 -0.344802
O  4.210653 -2.600809 0.509162
C  -2.557523 0.94549 0.691492
C  -3.655708 1.800544 0.067407
C  -3.001254 -0.487342 0.974491
C  -3.390224 3.314277 0.052789
C  -3.445248 -1.306373 -0.238353
C  -2.34634 -1.419528 -1.310136
C  -4.599783 4.032756 -0.54355
C  -2.151919 3.639807 -0.773883
C  -3.945806 -2.677292 0.203676
C  -1.085413 -2.037767 -0.808849
C  -4.088012 3.698699 2.337179
C  0.109471 -1.4377 -0.834219
C  1.355875 -2.015171 -0.336041
C  1.290428 -3.38114 0.269338
C  2.466832 -1.257537 -0.460937
C  3.832174 -1.588151 -0.039647
C  6.055336 -0.685792 -0.042849
C  6.763529 -1.464138 -1.134709
C  6.56817 0.733183 0.078758
H  -2.237928 1.389108 1.638398
H  -1.669796 0.944568 0.052585
H  -4.601518 1.602388 0.584634
H  -3.827876 1.491186 -0.967968
H  -3.829499 -0.459047 1.691432
H  -2.188788 -1.017299 1.484178
H  -4.286731 -0.792921 -0.716014
H  -2.133119 -0.435677 -1.73582
H  -2.737758 -2.031653 -2.130764
H  -5.531628 3.774764 -0.03663
H  -4.721813 3.75942 -1.592673
H  -4.479096 5.117265 -0.498455
H  -2.00365 4.719128 -0.849942
H  -1.247077 3.211453 -0.339471
H  -2.251198 3.247475 -1.786712
H  -4.793655 -2.580049 0.884467
H  -3.176515 -3.246328 0.730322
H  -4.277007 -3.278022 -0.64604
H  -1.171312 -3.039825 -0.399613
H  -3.653211 4.041084 3.277621
H  -4.43791 2.672316 2.492202
H  -4.963878 4.324185 2.132354
H  0.180408 -0.436633 -1.251626
H  0.601202 -3.384761 1.116419
H  0.898783 -4.097684 -0.4554
H  2.250858 -3.743035 0.614775
H  2.360482 -0.283309 -0.924823
H  6.177643 -1.196899 0.915136
H  7.82906 -1.525225 -0.909623
H  6.389989 -2.484417 -1.222518
H  6.654379 -0.972361 -2.103082
H  6.458763 1.282892 -0.857786
H  7.62761 0.719121 0.334982
H  6.04662 1.281763 0.864337
elementType: O C H
totalener: -970.28734313 hartree
nucrepener: 1813.90751448 hartree
electener: -2784.19485761 hartree
oneelecener: -4920.21003608 hartree
twoeener: 2136.01517847 hartree
cpcmener: -0.02322525 hartree
kineticenergy: 965.59880634 hartree
xcener: -96.762050218179 hartree
chargesum: -0.0000000
charge: -0.410497 -0.292173 -0.489312 -0.131135 -0.274580 -0.223484 0.391735 0.085997 -0.124430 -0.332290 -0.321549 -0.314386 -0.155348 -0.127353 -0.144492 0.013223 -0.267605 -0.177832 0.467574 0.156524 -0.263743 -0.251810 0.087604 0.073621 0.090590 0.089909 0.083705 0.086701 0.051388 0.085724 0.100495 0.097443 0.097376 0.102630 0.099954 0.095630 0.088280 0.093696 0.080226 0.094712 0.129953 0.122083 0.086203 0.092397 0.110481 0.105194 0.104755 0.109209 0.113316 0.062027 0.095327 0.094444 0.088912 0.087753 0.089118 0.096110
qa: -0.4105 -0.2922 -0.4893 -0.1311 -0.2746 -0.2235 0.3917 0.0860 -0.1244 -0.3323 -0.3215 -0.3144 -0.1553 -0.1274 -0.1445 0.0132 -0.2676 -0.1778 0.4676 0.1565 -0.2637 -0.2518 0.0876 0.0736 0.0906 0.0899 0.0837 0.0867 0.0514 0.0857 0.1005 0.0974 0.0974 0.1026 0.1000 0.0956 0.0883 0.0937 0.0802 0.0947 0.1300 0.1221 0.0862 0.0924 0.1105 0.1052 0.1048 0.1092 0.1133 0.0620 0.0953 0.0944 0.0889 0.0878 0.0891 0.0961
va: 1.9335 2.1278 2.0117 3.8486 3.8456 3.9271 3.7959 3.7461 3.9175 3.9157 3.9095 3.9465 3.8604 3.9295 3.9084 3.7033 3.9182 3.7799 4.1763 3.8202 3.9073 3.9321 1.0230 1.0043 1.0008 1.0101 1.0079 1.0058 1.0139 1.0090 1.0056 0.9986 1.0059 1.0081 1.0100 1.0064 1.0059 1.0046 1.0006 1.0040 0.9928 0.9902 0.9822 0.9849 1.0221 0.9963 0.9958 1.0372 1.0342 1.0239 1.0060 1.0169 1.0069 1.0070 1.0056 1.0085
dispcorr: -0.025307897 hartree
energy: -970.312651030361
dipole: -19.52724 18.07598 -1.45126 8.09775 -7.80074 0.29701 -0.70746 0.05263 -0.65483
magnitude: 1.61962 au
magnitude: 4.11675 debye
