program: Orca
programVersion: 5.0.2
elementType: O O O C C C C C C C C C C C C C C C C C C C H H H H H H H H H H H H H H H H H H H H H H H H H H H H H H H H H H
charge: 0
multiplicity: 1
keywords: wb97x-d3
keywords: def2-TZVPP
keywords: def2/J RIJCOSX
keywords: DEFGRID2
keywords: scfconv7
keywords: smallprint printgap noloewdin
keywords: NOSOSCF
formula: C19H34O3
InChI: InChI=1/C19H34O3/c1-15(2)22-18(20)14-17(4)11-8-10-16(3)12-9-13-19(5,6)21-7/h8,11,14-16H,9-10,12-13H2,1-7H3
56 atoms
O  -6.633897 2.318501 -0.720827
O  5.628043 -2.476468 0.508159
O  5.437918 -0.291226 0.070237
C  -4.031803 1.171836 0.246684
C  -4.246576 2.600995 -0.24153
C  -2.685534 0.610513 -0.20166
C  -5.670929 3.155911 -0.080798
C  -2.409184 -0.809701 0.301695
C  -1.334306 -1.519699 -0.538845
C  -5.724715 4.580607 -0.631502
C  -6.092306 3.166631 1.383688
C  -2.053397 -0.83708 1.783605
C  0.007001 -0.8677 -0.507953
C  -6.539234 2.171408 -2.114571
C  1.136545 -1.493171 -0.158902
C  2.470641 -0.89607 -0.154948
C  2.581658 0.550131 -0.519241
C  3.498152 -1.711312 0.167661
C  4.925413 -1.377918 0.2315
C  7.065605 -2.399947 0.597123
C  7.495272 -3.569324 1.45771
C  7.679406 -2.446908 -0.789061
H  -4.824165 0.519382 -0.132529
H  -4.105568 1.138915 1.337134
H  -3.948711 2.671483 -1.293549
H  -3.566012 3.271508 0.292676
H  -1.881387 1.281473 0.121051
H  -2.661243 0.614641 -1.297289
H  -3.328006 -1.392017 0.1651
H  -1.680482 -1.545298 -1.578847
H  -1.246633 -2.560337 -0.214654
H  -5.091399 5.238608 -0.035063
H  -6.740271 4.980455 -0.596584
H  -5.370231 4.646404 -1.66179
H  -7.081708 3.613485 1.502178
H  -6.131442 2.161035 1.805139
H  -5.39188 3.750889 1.981527
H  -1.145819 -0.26431 1.988436
H  -1.881425 -1.857646 2.132145
H  -2.850052 -0.417169 2.399528
H  0.042472 0.173743 -0.813397
H  -7.302185 1.451235 -2.413257
H  -5.571817 1.781572 -2.448752
H  -6.733014 3.10114 -2.660544
H  1.08173 -2.537773 0.136241
H  1.967754 1.155618 0.150243
H  3.59692 0.923847 -0.477539
H  2.200006 0.714885 -1.5288
H  3.265617 -2.744675 0.398605
H  7.34295 -1.466208 1.09241
H  7.222367 -4.523797 1.003771
H  8.578496 -3.556684 1.579887
H  7.050438 -3.52002 2.45233
H  8.766246 -2.402686 -0.709459
H  7.363961 -1.608247 -1.409337
H  7.419983 -3.373965 -1.303698
elementType: O C H
totalener: -970.28798704 hartree
nucrepener: 1737.63342294 hartree
electener: -2707.92140997 hartree
oneelecener: -4767.60395109 hartree
twoeener: 2059.68254111 hartree
cpcmener: -0.02291493 hartree
kineticenergy: 965.58936261 hartree
xcener: -96.757547100196 hartree
chargesum: -0.0000000
charge: -0.411112 -0.292474 -0.488045 -0.142320 -0.255398 -0.192517 0.384263 0.112838 -0.124639 -0.335594 -0.319929 -0.327528 -0.150399 -0.125282 -0.145804 0.019885 -0.266362 -0.180329 0.464940 0.157387 -0.253111 -0.264079 0.067581 0.079867 0.085716 0.091331 0.067526 0.078548 0.041240 0.094221 0.085826 0.097169 0.102744 0.097808 0.099850 0.095323 0.089533 0.084369 0.096683 0.095033 0.130080 0.120716 0.086165 0.092647 0.109959 0.103799 0.109305 0.104942 0.113042 0.062483 0.088023 0.088737 0.096424 0.095395 0.094563 0.088962
qa: -0.4111 -0.2925 -0.4880 -0.1423 -0.2554 -0.1925 0.3843 0.1128 -0.1246 -0.3356 -0.3199 -0.3275 -0.1504 -0.1253 -0.1458 0.0199 -0.2664 -0.1803 0.4649 0.1574 -0.2531 -0.2641 0.0676 0.0799 0.0857 0.0913 0.0675 0.0785 0.0412 0.0942 0.0858 0.0972 0.1027 0.0978 0.0998 0.0953 0.0895 0.0844 0.0967 0.0950 0.1301 0.1207 0.0862 0.0926 0.1100 0.1038 0.1093 0.1049 0.1130 0.0625 0.0880 0.0887 0.0964 0.0954 0.0946 0.0890
va: 1.9314 2.1275 2.0129 3.8631 3.8368 3.9396 3.7871 3.7527 3.9191 3.9192 3.9082 3.9524 3.8766 3.9295 3.9118 3.7009 3.9188 3.7848 4.1767 3.8194 3.9335 3.9055 1.0245 1.0077 1.0010 1.0134 1.0060 1.0091 1.0158 1.0042 1.0131 1.0060 1.0079 0.9982 1.0102 1.0060 1.0050 0.9998 1.0032 1.0053 0.9980 0.9905 0.9809 0.9850 1.0244 0.9967 1.0370 0.9950 1.0342 1.0235 1.0070 1.0058 1.0082 1.0061 1.0174 1.0067
dispcorr: -0.023784339 hartree
energy: -970.311771375657
dipole: -21.26327 20.87750 -0.38576 8.49515 -8.77311 -0.27795 -0.08330 -0.28214 -0.36544
magnitude: 0.59968 au
magnitude: 1.52427 debye
