program: Orca
programVersion: 5.0.2
elementType: O O O C C C C C C C C C C C C C C C C C C C H H H H H H H H H H H H H H H H H H H H H H H H H H H H H H H H H H
charge: 0
multiplicity: 1
keywords: wb97x-d3
keywords: def2-TZVPP
keywords: def2/J RIJCOSX
keywords: DEFGRID2
keywords: scfconv7
keywords: smallprint printgap noloewdin
keywords: NOSOSCF
formula: C19H34O3
InChI: InChI=1/C19H34O3/c1-15(2)22-18(20)14-17(4)11-8-10-16(3)12-9-13-19(5,6)21-7/h8,11,14-16H,9-10,12-13H2,1-7H3
56 atoms
O  -4.089856 3.888609 1.08093
O  5.065588 -1.99418 0.451395
O  4.611184 -1.248775 -1.607633
C  -3.849875 1.012023 0.35823
C  -4.107097 2.13993 -0.635199
C  -2.991795 -0.092609 -0.248426
C  -4.789137 3.390373 -0.058948
C  -2.704591 -1.263185 0.693758
C  -2.012148 -2.42766 -0.0449
C  -6.183233 3.063349 0.463837
C  -4.89899 4.454804 -1.15001
C  -1.898059 -0.837286 1.915455
C  -0.744862 -2.032778 -0.728853
C  -2.765827 4.318592 0.88939
C  0.479342 -2.266669 -0.243336
C  1.730484 -1.845763 -0.870807
C  1.643367 -1.186046 -2.210647
C  2.864355 -2.070076 -0.172315
C  4.235978 -1.716872 -0.554196
C  6.470318 -1.695207 0.315743
C  6.721809 -0.231729 0.624492
C  7.192738 -2.619698 1.27185
H  -4.798083 0.5856 0.701512
H  -3.356551 1.412866 1.247522
H  -4.72729 1.769701 -1.457739
H  -3.157548 2.42758 -1.100446
H  -2.042947 0.343305 -0.582934
H  -3.484769 -0.472973 -1.150789
H  -3.665364 -1.656447 1.046226
H  -2.705562 -2.826815 -0.791549
H  -1.817586 -3.231951 0.669581
H  -6.154018 2.352234 1.291301
H  -6.797866 2.628985 -0.3255
H  -6.689278 3.963794 0.818519
H  -5.317959 5.384052 -0.756809
H  -3.935894 4.685099 -1.610234
H  -5.557692 4.108505 -1.948551
H  -1.667493 -1.693589 2.553447
H  -2.442147 -0.11946 2.531212
H  -0.950443 -0.371808 1.63227
H  -0.855191 -1.502556 -1.669742
H  -2.379404 4.610356 1.867513
H  -2.686171 5.190603 0.230332
H  -2.104879 3.538177 0.495168
H  0.573919 -2.794119 0.702446
H  2.611164 -0.942108 -2.631143
H  1.119388 -1.832949 -2.916818
H  1.06196 -0.264075 -2.139834
H  2.77203 -2.546027 0.797813
H  6.786078 -1.916875 -0.706503
H  7.787932 -0.016276 0.541028
H  6.200604 0.431357 -0.066258
H  6.409845 0.015114 1.641229
H  8.267875 -2.454203 1.199276
H  7.003821 -3.667765 1.035835
H  6.897368 -2.439802 2.307347
elementType: O C H
totalener: -970.28750272 hartree
nucrepener: 1774.56759051 hartree
electener: -2744.85509324 hartree
oneelecener: -4841.52416151 hartree
twoeener: 2096.66906827 hartree
cpcmener: -0.02260749 hartree
kineticenergy: 965.58423005 hartree
xcener: -96.757364196353 hartree
chargesum: -0.0000000
charge: -0.410472 -0.293043 -0.488321 -0.139599 -0.255255 -0.207948 0.378018 0.146239 -0.152582 -0.316765 -0.337099 -0.349242 -0.132060 -0.126174 -0.162792 0.018930 -0.264982 -0.179559 0.467341 0.159793 -0.264876 -0.252523 0.076340 0.071538 0.093103 0.086968 0.073968 0.080747 0.041758 0.096015 0.089955 0.096045 0.088908 0.099728 0.102722 0.097706 0.097476 0.095933 0.099307 0.088073 0.126476 0.121880 0.094365 0.085472 0.113519 0.109983 0.104612 0.103187 0.113782 0.061284 0.094997 0.095115 0.088863 0.088902 0.096286 0.087961
qa: -0.4105 -0.2930 -0.4883 -0.1396 -0.2553 -0.2079 0.3780 0.1462 -0.1526 -0.3168 -0.3371 -0.3492 -0.1321 -0.1262 -0.1628 0.0189 -0.2650 -0.1796 0.4673 0.1598 -0.2649 -0.2525 0.0763 0.0715 0.0931 0.0870 0.0740 0.0807 0.0418 0.0960 0.0900 0.0960 0.0889 0.0997 0.1027 0.0977 0.0975 0.0959 0.0993 0.0881 0.1265 0.1219 0.0944 0.0855 0.1135 0.1100 0.1046 0.1032 0.1138 0.0613 0.0950 0.0951 0.0889 0.0889 0.0963 0.0880
va: 1.9312 2.1280 2.0121 3.8484 3.8455 3.9377 3.7975 3.7359 3.9433 3.9066 3.9176 3.9635 3.8457 3.9250 3.8839 3.6943 3.9190 3.7866 4.1740 3.8175 3.9068 3.9330 1.0116 1.0219 1.0137 1.0002 1.0042 1.0087 1.0188 1.0074 1.0125 1.0065 1.0053 1.0095 1.0081 0.9987 1.0062 1.0044 1.0040 0.9965 0.9963 0.9902 0.9857 0.9812 1.0216 1.0365 0.9971 0.9956 1.0336 1.0245 1.0062 1.0167 1.0069 1.0057 1.0083 1.0070
dispcorr: -0.024291328 hartree
energy: -970.311794052221
dipole: -18.70888 18.09596 -0.61293 11.89842 -12.14328 -0.24485 3.48132 -3.42672 0.05460
magnitude: 0.66228 au
magnitude: 1.68338 debye
