program: Orca
programVersion: 5.0.2
elementType: O O O C C C C C C C C C C C C C C C C C C C H H H H H H H H H H H H H H H H H H H H H H H H H H H H H H H H H H
charge: 0
multiplicity: 1
keywords: wb97x-d3
keywords: def2-TZVPP
keywords: def2/J RIJCOSX
keywords: DEFGRID2
keywords: scfconv7
keywords: smallprint printgap noloewdin
keywords: NOSOSCF
formula: C19H34O3
InChI: InChI=1/C19H34O3/c1-15(2)22-18(20)14-17(4)11-8-10-16(3)12-9-13-19(5,6)21-7/h8,11,14-16H,9-10,12-13H2,1-7H3
56 atoms
O  -5.29053 3.573951 -0.639375
O  5.194914 -1.15971 -0.290482
O  4.472663 -2.086725 1.612363
C  -3.690015 1.111902 -0.066371
C  -3.209472 2.543453 0.14461
C  -2.538653 0.178729 -0.428048
C  -4.304643 3.592253 0.39249
C  -2.959249 -1.259816 -0.727706
C  -1.787287 -2.067389 -1.314026
C  -3.659697 4.971911 0.522681
C  -5.082681 3.281013 1.665851
C  -3.569859 -1.953616 0.485926
C  -0.640138 -2.249501 -0.378151
C  -4.872834 3.918216 -1.935765
C  0.609899 -1.845605 -0.629542
C  1.752851 -2.02975 0.262282
C  1.500945 -2.689379 1.581118
C  2.949766 -1.591554 -0.184622
C  4.245326 -1.660054 0.500674
C  6.56191 -1.132904 0.166894
C  7.21169 -2.485755 -0.051919
C  7.243574 -0.030682 -0.615551
H  -4.440354 1.079565 -0.863232
H  -4.188311 0.752336 0.837934
H  -2.602836 2.847068 -0.715921
H  -2.525227 2.571127 0.998915
H  -1.798681 0.181537 0.380988
H  -2.02317 0.583607 -1.306637
H  -3.724581 -1.228066 -1.512078
H  -1.442652 -1.5902 -2.235661
H  -2.164349 -3.057571 -1.595646
H  -3.022705 5.00681 1.408513
H  -4.413957 5.755177 0.628811
H  -3.028463 5.223005 -0.332492
H  -4.411054 3.214431 2.522527
H  -5.813703 4.064279 1.878287
H  -5.623913 2.336131 1.593442
H  -4.508704 -1.487089 0.785736
H  -2.903901 -1.922966 1.351417
H  -3.787965 -3.002803 0.274526
H  -0.860307 -2.75988 0.554797
H  -4.572589 4.967878 -2.027189
H  -5.725173 3.762095 -2.599279
H  -4.04875 3.300288 -2.309242
H  0.815286 -1.343153 -1.571246
H  1.095521 -3.692062 1.430626
H  2.390698 -2.774913 2.192969
H  0.752136 -2.130527 2.146147
H  2.984387 -1.137667 -1.168982
H  6.578794 -0.882853 1.230424
H  8.250162 -2.452263 0.280203
H  6.7152 -3.277357 0.50954
H  7.207176 -2.758153 -1.109161
H  6.7701 0.936363 -0.440551
H  7.23106 -0.231946 -1.688472
H  8.285333 0.051041 -0.304812
elementType: O C H
totalener: -970.28841382 hartree
nucrepener: 1762.20756407 hartree
electener: -2732.49597788 hartree
oneelecener: -4816.82761382 hartree
twoeener: 2084.33163593 hartree
cpcmener: -0.02284624 hartree
kineticenergy: 965.58427851 hartree
xcener: -96.757013172868 hartree
chargesum: 0.0000000
charge: -0.413820 -0.292245 -0.488506 -0.141992 -0.253440 -0.201507 0.390321 0.123438 -0.132933 -0.335284 -0.323154 -0.338545 -0.149496 -0.127951 -0.145820 0.018268 -0.266401 -0.180517 0.467962 0.156168 -0.263161 -0.252334 0.069293 0.082230 0.085324 0.091892 0.073403 0.074885 0.042299 0.084068 0.098998 0.098463 0.102794 0.097419 0.090206 0.099741 0.094313 0.096283 0.082937 0.099329 0.130151 0.092886 0.121435 0.087458 0.111039 0.104922 0.109682 0.103272 0.113071 0.062065 0.095119 0.094047 0.088709 0.096716 0.087964 0.088540
qa: -0.4138 -0.2922 -0.4885 -0.1420 -0.2534 -0.2015 0.3903 0.1234 -0.1329 -0.3353 -0.3232 -0.3385 -0.1495 -0.1280 -0.1458 0.0183 -0.2664 -0.1805 0.4680 0.1562 -0.2632 -0.2523 0.0693 0.0822 0.0853 0.0919 0.0734 0.0749 0.0423 0.0841 0.0990 0.0985 0.1028 0.0974 0.0902 0.0997 0.0943 0.0963 0.0829 0.0993 0.1302 0.0929 0.1214 0.0875 0.1110 0.1049 0.1097 0.1033 0.1131 0.0621 0.0951 0.0940 0.0887 0.0967 0.0880 0.0885
va: 1.9255 2.1269 2.0123 3.8688 3.8436 3.9251 3.7768 3.7418 3.9143 3.9184 3.9122 3.9604 3.8739 3.9309 3.9123 3.7004 3.9190 3.7816 4.1736 3.8212 3.9059 3.9324 1.0195 1.0035 1.0022 1.0124 1.0064 1.0123 1.0185 1.0136 1.0042 1.0056 1.0075 0.9982 1.0048 1.0094 1.0067 1.0015 0.9969 1.0030 0.9926 0.9847 0.9903 0.9801 1.0235 0.9954 1.0369 0.9967 1.0341 1.0236 1.0062 1.0174 1.0068 1.0082 1.0071 1.0059
dispcorr: -0.023898692 hartree
energy: -970.312312507390
dipole: -17.38629 17.33583 -0.05045 10.29240 -9.95803 0.33437 -1.00710 0.11846 -0.88863
magnitude: 0.95080 au
magnitude: 2.41674 debye
