program: Orca
programVersion: 5.0.2
elementType: O O O C C C C C C C C C C C C C C C C C C C H H H H H H H H H H H H H H H H H H H H H H H H H H H H H H H H H H
charge: 0
multiplicity: 1
keywords: wb97x-d3
keywords: def2-TZVPP
keywords: def2/J RIJCOSX
keywords: DEFGRID2
keywords: scfconv7
keywords: smallprint printgap noloewdin
keywords: NOSOSCF
formula: C19H34O3
InChI: InChI=1/C19H34O3/c1-15(2)22-18(20)14-17(4)11-8-10-16(3)12-9-13-19(5,6)21-7/h8,11,14-16H,9-10,12-13H2,1-7H3
56 atoms
O  -5.001073 3.673543 -0.614526
O  5.01696 -1.01834 -0.267503
O  4.367609 -2.227762 1.499714
C  -3.603366 1.088362 -0.017241
C  -3.028687 2.481183 0.217783
C  -2.517152 0.093636 -0.413812
C  -4.055869 3.599304 0.452656
C  -3.02692 -1.312694 -0.727359
C  -1.916722 -2.170715 -1.364265
C  -3.321556 4.92733 0.637711
C  -4.901267 3.315452 1.68903
C  -3.639926 -1.995681 0.490986
C  -0.751268 -2.41673 -0.466802
C  -4.510246 4.002236 -1.889237
C  0.486537 -1.966971 -0.700051
C  1.643622 -2.180363 0.167447
C  1.429419 -2.970019 1.419203
C  2.812267 -1.63577 -0.235392
C  4.110166 -1.684382 0.446942
C  6.374821 -0.929264 0.213962
C  7.142118 -2.186952 -0.147524
C  6.968586 0.309072 -0.423896
H  -4.362752 1.121175 -0.804945
H  -4.112374 0.742165 0.885828
H  -2.387247 2.75079 -0.628078
H  -2.361906 2.454937 1.08508
H  -1.764974 0.040083 0.381198
H  -1.995199 0.482031 -1.29568
H  -3.810895 -1.223443 -1.488617
H  -1.580091 -1.692879 -2.288252
H  -2.351484 -3.136023 -1.646613
H  -2.727551 4.903327 1.552427
H  -4.023803 5.759464 0.721808
H  -2.634945 5.144646 -0.182718
H  -5.511366 2.41946 1.567613
H  -4.266722 3.170636 2.563676
H  -5.574571 4.148481 1.901574
H  -3.926249 -3.025204 0.266002
H  -4.53981 -1.480751 0.82847
H  -2.946818 -2.022101 1.334671
H  -0.95094 -3.000125 0.426872
H  -5.34691 3.923304 -2.584971
H  -3.724959 3.326082 -2.243488
H  -4.12446 5.025578 -1.951123
H  0.66778 -1.38704 -1.601193
H  1.037691 -3.959626 1.17786
H  2.330309 -3.096992 2.005593
H  0.681051 -2.481909 2.046493
H  2.814665 -1.086968 -1.170522
H  6.359531 -0.804223 1.299483
H  6.709152 -3.078308 0.306172
H  7.174362 -2.329932 -1.229145
H  8.169303 -2.104016 0.209564
H  6.411725 1.206944 -0.153442
H  6.988852 0.229173 -1.512293
H  7.994842 0.440791 -0.080719
elementType: O C H
totalener: -970.28827095 hartree
nucrepener: 1770.40897272 hartree
electener: -2740.69724366 hartree
oneelecener: -4833.22592504 hartree
twoeener: 2092.52868137 hartree
cpcmener: -0.02280076 hartree
kineticenergy: 965.59544403 hartree
xcener: -96.759362714490 hartree
chargesum: 0.0000000
charge: -0.412596 -0.292809 -0.489290 -0.143509 -0.253855 -0.202205 0.389661 0.127058 -0.136911 -0.336158 -0.322891 -0.338222 -0.139443 -0.127066 -0.151243 0.017347 -0.265604 -0.179325 0.468743 0.156688 -0.263667 -0.253152 0.069171 0.082629 0.085378 0.092354 0.072809 0.075173 0.041784 0.085150 0.098919 0.097950 0.102494 0.097515 0.093856 0.090632 0.099865 0.098320 0.096039 0.083432 0.127702 0.121432 0.086753 0.092925 0.110043 0.104527 0.109376 0.104275 0.112962 0.062836 0.094086 0.088793 0.095331 0.096611 0.088100 0.089226
qa: -0.4126 -0.2928 -0.4893 -0.1435 -0.2539 -0.2022 0.3897 0.1271 -0.1369 -0.3362 -0.3229 -0.3382 -0.1394 -0.1271 -0.1512 0.0173 -0.2656 -0.1793 0.4687 0.1567 -0.2637 -0.2532 0.0692 0.0826 0.0854 0.0924 0.0728 0.0752 0.0418 0.0852 0.0989 0.0979 0.1025 0.0975 0.0939 0.0906 0.0999 0.0983 0.0960 0.0834 0.1277 0.1214 0.0868 0.0929 0.1100 0.1045 0.1094 0.1043 0.1130 0.0628 0.0941 0.0888 0.0953 0.0966 0.0881 0.0892
va: 1.9286 2.1279 2.0112 3.8677 3.8422 3.9305 3.7773 3.7363 3.9188 3.9189 3.9116 3.9615 3.8608 3.9303 3.9134 3.6990 3.9193 3.7825 4.1735 3.8190 3.9052 3.9325 1.0210 1.0034 1.0019 1.0124 1.0059 1.0124 1.0186 1.0133 1.0052 1.0057 1.0078 0.9982 1.0068 1.0047 1.0092 1.0029 1.0018 0.9965 0.9938 0.9904 0.9804 0.9849 1.0240 0.9961 1.0367 0.9962 1.0342 1.0235 1.0176 1.0068 1.0061 1.0083 1.0071 1.0057
dispcorr: -0.024015607 hartree
energy: -970.312286553627
dipole: -16.58924 16.54104 -0.04820 10.81652 -10.41804 0.39848 -0.45606 -0.33700 -0.79305
magnitude: 0.88884 au
magnitude: 2.25926 debye
