program: Orca
programVersion: 5.0.2
elementType: O O O C C C C C C C C C C C C C C C C C C C H H H H H H H H H H H H H H H H H H H H H H H H H H H H H H H H H H
charge: 0
multiplicity: 1
keywords: wb97x-d3
keywords: def2-TZVPP
keywords: def2/J RIJCOSX
keywords: DEFGRID2
keywords: scfconv7
keywords: smallprint printgap noloewdin
keywords: NOSOSCF
formula: C19H34O3
InChI: InChI=1/C19H34O3/c1-15(2)22-18(20)14-17(4)11-8-10-16(3)12-9-13-19(5,6)21-7/h8,11,14-16H,9-10,12-13H2,1-7H3
56 atoms
O  -5.855183 2.557976 -1.326843
O  5.421949 -2.173781 -0.1200
O  5.056644 -0.132627 0.719331
C  -3.643266 0.945826 -0.158504
C  -4.200329 2.227922 0.450338
C  -3.071803 0.011985 0.902598
C  -4.858373 3.205721 -0.536595
C  -2.646292 -1.364179 0.386381
C  -1.597601 -1.305123 -0.73923
C  -3.847189 3.725484 -1.552519
C  -5.443396 4.386532 0.23752
C  -2.16497 -2.241901 1.535478
C  -0.311625 -0.66367 -0.340151
C  -6.97395 2.037693 -0.654966
C  0.870522 -1.28914 -0.354537
C  2.151515 -0.697425 0.025083
C  2.146842 0.721164 0.497624
C  3.240611 -1.487258 -0.092448
C  4.634133 -1.154794 0.223288
C  6.843034 -2.087343 0.106494
C  7.166471 -2.464519 1.53936
C  7.483902 -3.02434 -0.894871
H  -2.868957 1.192117 -0.890064
H  -4.4280 0.419789 -0.711756
H  -3.395094 2.765746 0.961385
H  -4.916036 1.967855 1.23777
H  -3.826961 -0.141499 1.681377
H  -2.228001 0.498006 1.405626
H  -3.532855 -1.838608 -0.05056
H  -2.015812 -0.755453 -1.588942
H  -1.406367 -2.320622 -1.096857
H  -3.439854 2.925077 -2.172195
H  -3.012149 4.214452 -1.04964
H  -4.30659 4.458142 -2.219443
H  -5.971306 5.07419 -0.427149
H  -6.136291 4.072702 1.020657
H  -4.645423 4.949153 0.724763
H  -1.301702 -1.804979 2.04272
H  -1.872988 -3.23532 1.188227
H  -2.949252 -2.373817 2.283533
H  -0.366436 0.375333 -0.028544
H  -7.572067 1.50333 -1.394722
H  -7.610538 2.812929 -0.214519
H  -6.716755 1.325075 0.136161
H  0.903527 -2.327303 -0.674711
H  3.130187 1.083395 0.770749
H  1.748098 1.375537 -0.280081
H  1.491182 0.829278 1.363916
H  3.092677 -2.493885 -0.467347
H  7.175014 -1.065138 -0.090735
H  6.697312 -1.792881 2.258424
H  6.845756 -3.484545 1.75932
H  8.24432 -2.412131 1.697892
H  7.245154 -2.738991 -1.920191
H  7.164048 -4.056562 -0.740089
H  8.568225 -2.991844 -0.787249
elementType: O C H
totalener: -970.28858513 hartree
nucrepener: 1764.41559958 hartree
electener: -2734.70418471 hartree
oneelecener: -4821.14293177 hartree
twoeener: 2086.43874706 hartree
cpcmener: -0.02313280 hartree
kineticenergy: 965.59160316 hartree
xcener: -96.758826105325 hartree
chargesum: -0.0000000
charge: -0.415294 -0.291809 -0.488820 -0.142117 -0.255747 -0.201086 0.390352 0.107507 -0.135582 -0.324410 -0.332543 -0.332916 -0.144260 -0.126525 -0.153823 0.023488 -0.268022 -0.179756 0.465213 0.156927 -0.264224 -0.252320 0.077574 0.076786 0.091833 0.085966 0.079679 0.073554 0.044434 0.100837 0.092333 0.096062 0.089659 0.100545 0.102868 0.097015 0.098316 0.084302 0.095465 0.095116 0.127661 0.121970 0.092826 0.085706 0.109753 0.109236 0.105484 0.104085 0.112956 0.061786 0.095181 0.088854 0.095229 0.096199 0.087832 0.088665
qa: -0.4153 -0.2918 -0.4888 -0.1421 -0.2557 -0.2011 0.3904 0.1075 -0.1356 -0.3244 -0.3325 -0.3329 -0.1443 -0.1265 -0.1538 0.0235 -0.2680 -0.1798 0.4652 0.1569 -0.2642 -0.2523 0.0776 0.0768 0.0918 0.0860 0.0797 0.0736 0.0444 0.1008 0.0923 0.0961 0.0897 0.1005 0.1029 0.0970 0.0983 0.0843 0.0955 0.0951 0.1277 0.1220 0.0928 0.0857 0.1098 0.1092 0.1055 0.1041 0.1130 0.0618 0.0952 0.0889 0.0952 0.0962 0.0878 0.0887
va: 1.9222 2.1271 2.0126 3.8494 3.8430 3.8794 3.7733 3.7720 3.9182 3.9117 3.9198 3.9545 3.8745 3.9314 3.9203 3.7036 3.9198 3.7862 4.1739 3.8193 3.9071 3.9316 1.0038 1.0169 1.0114 1.0024 1.0135 1.0044 1.0154 1.0011 1.0117 1.0066 1.0054 1.0095 1.0074 0.9986 1.0059 0.9990 1.0038 1.0052 0.9932 0.9897 0.9849 0.9807 1.0255 1.0371 0.9952 0.9967 1.0344 1.0240 1.0164 1.0067 1.0062 1.0084 1.0072 1.0057
dispcorr: -0.024246929 hartree
energy: -970.312832063208
dipole: -20.86179 19.98703 -0.87476 5.24290 -5.74116 -0.49826 3.58027 -3.25170 0.32857
magnitude: 1.05897 au
magnitude: 2.69169 debye
