program: Orca
programVersion: 5.0.2
elementType: O O O C C C C C C C C C C C C C C C C C C C H H H H H H H H H H H H H H H H H H H H H H H H H H H H H H H H H H
charge: 0
multiplicity: 1
keywords: wb97x-d3
keywords: def2-TZVPP
keywords: def2/J RIJCOSX
keywords: DEFGRID2
keywords: scfconv7
keywords: smallprint printgap noloewdin
keywords: NOSOSCF
formula: C19H34O3
InChI: InChI=1/C19H34O3/c1-15(2)22-18(20)14-17(4)11-8-10-16(3)12-9-13-19(5,6)21-7/h8,11,14-16H,9-10,12-13H2,1-7H3
56 atoms
O  -0.742471 1.725592 -0.876944
O  3.596394 -0.366621 0.524463
O  2.862992 0.289692 -1.484114
C  -2.986073 0.350187 0.304597
C  -1.87975 1.063429 1.0745
C  -3.570132 -0.82029 1.105321
C  -1.197438 2.242913 0.372303
C  -4.098874 -1.983387 0.254326
C  -2.981223 -2.994695 -0.073816
C  -0.025697 2.712731 1.233433
C  -2.181181 3.392973 0.158582
C  -5.236665 -2.712327 0.959841
C  -1.8180 -2.399492 -0.789216
C  0.07758 2.55318 -1.662303
C  -0.620622 -2.185994 -0.232906
C  0.483658 -1.479131 -0.874877
C  0.355408 -1.176628 -2.333565
C  1.52776 -1.139341 -0.088348
C  2.696922 -0.337933 -0.459792
C  4.810076 0.402244 0.40377
C  4.557832 1.838381 0.82211
C  5.834248 -0.282781 1.283312
H  -2.593171 -0.007749 -0.647572
H  -3.792824 1.043919 0.05094
H  -1.110083 0.325668 1.329184
H  -2.275266 1.424788 2.029145
H  -4.374076 -0.441939 1.74365
H  -2.814974 -1.213036 1.796441
H  -4.488193 -1.58076 -0.688561
H  -3.408025 -3.792736 -0.69035
H  -2.647089 -3.456342 0.860682
H  0.738121 1.935803 1.320559
H  -0.370376 2.951689 2.240545
H  0.450135 3.611611 0.837114
H  -2.614711 3.701259 1.111144
H  -1.700004 4.273388 -0.271363
H  -3.001453 3.107673 -0.501947
H  -6.082662 -2.046171 1.138158
H  -4.915354 -3.101961 1.929163
H  -5.601491 -3.556626 0.371238
H  -1.99987 -2.089041 -1.814043
H  1.062698 2.73115 -1.219612
H  -0.374186 3.526865 -1.880035
H  0.230257 2.044601 -2.614698
H  -0.464179 -2.486957 0.799489
H  -0.460952 -0.473835 -2.507592
H  1.256757 -0.758278 -2.764009
H  0.106324 -2.086931 -2.881054
H  1.508969 -1.463417 0.946384
H  5.150483 0.373674 -0.633903
H  3.82416 2.331012 0.183563
H  4.207367 1.891708 1.854559
H  5.485023 2.408741 0.754303
H  6.000298 -1.315467 0.973935
H  5.53139 -0.280423 2.331987
H  6.787902 0.240352 1.210749
elementType: O C H
totalener: -970.28427641 hartree
nucrepener: 1975.69980092 hartree
electener: -2945.98407733 hartree
oneelecener: -5245.05496769 hartree
twoeener: 2299.07089037 hartree
cpcmener: -0.02202167 hartree
kineticenergy: 965.60144404 hartree
xcener: -96.761824362850 hartree
chargesum: -0.0000000
charge: -0.382889 -0.294044 -0.490257 -0.154609 -0.169515 -0.204569 0.316500 0.082665 -0.133386 -0.344560 -0.355057 -0.310874 -0.083611 -0.135115 -0.185424 0.020488 -0.286183 -0.202167 0.477620 0.157164 -0.266602 -0.251371 0.077011 0.093958 0.075767 0.099799 0.085721 0.069569 0.049994 0.090387 0.080494 0.095488 0.104667 0.102022 0.098503 0.100172 0.099544 0.088852 0.086632 0.089183 0.129552 0.087859 0.107910 0.107684 0.115720 0.098025 0.111897 0.120050 0.113992 0.061040 0.092462 0.089025 0.100383 0.095876 0.087545 0.089013
qa: -0.3829 -0.2940 -0.4903 -0.1546 -0.1695 -0.2046 0.3165 0.0827 -0.1334 -0.3446 -0.3551 -0.3109 -0.0836 -0.1351 -0.1854 0.0205 -0.2862 -0.2022 0.4776 0.1572 -0.2666 -0.2514 0.0770 0.0940 0.0758 0.0998 0.0857 0.0696 0.0500 0.0904 0.0805 0.0955 0.1047 0.1020 0.0985 0.1002 0.0995 0.0889 0.0866 0.0892 0.1296 0.0879 0.1079 0.1077 0.1157 0.0980 0.1119 0.1200 0.1140 0.0610 0.0925 0.0890 0.1004 0.0959 0.0875 0.0890
va: 1.9455 2.1245 1.9912 3.8409 3.7814 3.8937 3.8484 3.7469 3.9302 3.9309 3.9487 3.9473 3.8215 3.9288 3.8926 3.6249 3.9047 3.7802 4.1206 3.8265 3.9043 3.9341 1.0200 1.0075 1.0125 1.0162 1.0057 1.0097 1.0205 1.0086 1.0119 1.0014 1.0074 0.9983 1.0044 1.0032 1.0036 1.0042 0.9998 1.0047 0.9990 0.9802 0.9915 0.9888 1.0204 1.0004 1.0302 1.0009 1.0354 1.0240 1.0121 1.0072 1.0076 1.0086 1.0069 1.0058
dispcorr: -0.030627203 hartree
energy: -970.314903614079
dipole: -12.23836 11.63715 -0.60121 7.44910 -7.27607 0.17303 6.78456 -5.89560 0.88896
magnitude: 1.08704 au
magnitude: 2.76303 debye
